{"text_format":"1","workbook":"xlsx","n_sheets":8,"sheets":["INSCHRIJVING SPORTSCHOOL","GEGEVENS-1","INVOER JUDOKA'S","PRINT INSCHRIJFLIJST","ALLE POULE'S","GEGEVENS-2023","GEWICHT PER INSCHRIJVING","Blad4"],"not_rendered":{"charts":0,"images":13,"macros":1,"external_links":4,"defined_names":49,"comments":1,"pivot_tables":0},"unopened":[],"bounds":{"document_bytes":16777216,"sheet_cells":100000,"rows_first":2000,"rows_last":500,"rows_between":2000,"halvings":0,"cell_chars":16384,"cell_head_chars":4096},"cells_cut":0,"cells_raw":0,"read":"whole","date_system":"1900"}

{"sheet":"INSCHRIJVING SPORTSCHOOL","index":0,"n_rows":38,"n_cols":16,"rows_kept":38,"cut":false,"hidden":false,"merged":[[2,14,2,20],[5,6,5,8],[30,2,30,4],[22,12,22,19],[22,7,22,8]]}
[]
[null,null,"INSCHRIJFFORMULIER 10E TOPJUDO TOERNOOI ALMERE 26 NOVEMBER 2023"]
[null,null,null,null,null,null,null,null,null,null,null,null,null,null,{"$f":"IF(B17=9,\"Klik hier om de Judoka's in te schrijven.\",0)","v":0}]
[null,null,"Gegevens Sportschool:     (*Alle velden verplicht invullen om verder te gaan)"]
[null,{"$f":"IF(D5>0,1,0)","v":0},"* Sportschool",null,2,2]
[{"$f":"IF($D$5>0,$A$7,0)","v":0},{"$f":"IF(D6>0,1,0)","v":0},"* Straat + Huisnummer"]
[{"$f":"IF(ISERROR(VLOOKUP($D$5,'GEGEVENS-1'!$AM:$AO,3,FALSE)),\"\",VLOOKUP($D$5,'GEGEVENS-1'!$AM:$AO,3,FALSE))","v":""},0,"* Postcode"]
[null,0,"* Plaats"]
[null,0,"* Contactpersoon"]
[null,0,"* Email"]
[null,0,"* JBN.NR."]
[null,{"$f":"IF(D12>0,1,0)","v":0},"* Telefoon"]
[]
[null,{"$f":"IF(B18=TRUE,1,0)","v":0},null,"Voor akkoord privacyverklaring Stichting Topjudo Almere "]
[null,null,null,"https://topjudoalmere.nl/privacyverklaring"]
[]
[null,{"$f":"SUM(B5+B6+B7+B8+B9+B10+B11+B12+B14)","v":0}]
[null,false]
[]
[]
[]
[]
[null,null,"Dit bestand terugmailen naar :","info@topjudoalmere.nl",null,null,null,{"$f":"IF(J23>0,\"Aantal deelnemers\",0)","v":0},null,{"$f":"'INVOER JUDOKA''S'!$R$1","v":0},{"$f":"IF(J23>0,J23*14,0)","v":0},null,{"$f":"IF(J23>0,\"Overmaken op rekeningnr. NL63 RABO 0171509374\",0)","v":0}]
[null,null,null,null,null,null,null,null,null,null,{"$f":"IF(L24>0,\"Aantal inschrijvingen\",0)","v":0},{"$f":"IF('[3]INSCHRIJFFORM JUDOKA'!O10>0,'[3]INSCHRIJFFORM JUDOKA'!O10,0)","v":0}]
[]
[]
[]
[null,null,null,"Stichting Topjudo Almere"]
[null,null,null,"Malachietstraat 36"]
[null,null,null,"1339 HV Almere"]
[]
[]
[]
[]
[]
[null,null,"Naar onze website"]
[]
[null,null,null,null,null,null,null,null,"MATSURU, Official partner Topjudotoernooi Almere",null,null,null,null,null,null,"Ontwerp & Design: Ronald van Grinsven versie 2023"]

{"sheet":"GEGEVENS-1","index":1,"n_rows":119,"n_cols":65,"rows_kept":119,"cut":false,"hidden":true,"merged":[[66,1,66,2],[24,1,24,2],[18,1,18,2],[37,1,37,3],[1,36,2,55],[4,3,5,4],[3,0,3,2],[3,16,3,24],[4,13,4,14],[3,10,3,15]]}
["gegevens","Sportschool","Adres","Postcode","Plaats","Contactpersoon","Email","JBN.NR.","Telefoon","VOORNAAM","ACHTERNAAM","JUDOKA","aantal deelnemers","X-NR.","JBN NR.","GEB.DAT.","GESLACHT","GW","GRADUATIE","ERVARING","CATEGORIE","POULE",null,null,null,null,null,null,null,null,null,null,null,{"$f":"IF(ISERROR(VLOOKUP($D$8,$M$16:$P$115,6,FALSE)),\"\",VLOOKUP($D$8,'GEGEVENS-1'!$M$16:$P$115,6,FALSE))","v":""},"IS FOUT"]
[1,{"$f":"'INSCHRIJVING SPORTSCHOOL'!$D$5","v":0},{"$f":"'INSCHRIJVING SPORTSCHOOL'!$D$6","v":0},{"$f":"'INSCHRIJVING SPORTSCHOOL'!$D$7","v":0},{"$f":"'INSCHRIJVING SPORTSCHOOL'!$D$8","v":0},{"$f":"'INSCHRIJVING SPORTSCHOOL'!$D$9","v":0},{"$f":"'INSCHRIJVING SPORTSCHOOL'!$D$10","v":0},{"$f":"'INSCHRIJVING SPORTSCHOOL'!$D$11","v":0},{"$f":"'INSCHRIJVING SPORTSCHOOL'!$D$12","v":0},{"$f":"#REF!","v":{"$error":"#REF!"}},{"$f":"#REF!","v":{"$error":"#REF!"}},{"$f":"CONCATENATE(#REF!,\" \",#REF!)","v":{"$error":"#REF!"}},{"$f":"IF($K$2>0,1,0)","v":{"$error":"#REF!"}},{"$f":"#REF!","v":{"$error":"#REF!"}},{"$f":"IF(#REF!=0,\"JBN NR. verplicht\",#REF!)","v":{"$error":"#REF!"}},{"$f":"$E$7","v":"--"},{"$f":"$C$20","v":""},{"$f":"$C$26","v":""},{"$f":"$C$39","v":""},{"$f":"#REF!","v":{"$error":"#REF!"}},{"$f":"$C$15","v":"//"},{"$f":"$C$16","v":""}]
[null,null,null,null,null,null,null,null,null,null,null,null,null,null,null,null,null,null,null,null,null,null,null,null,null,null,null,null,null,"Poule bij categorie zoeken",null,null,null,"VERSNELLEN MACRO"]
[0,null,null,null,null,null,null,null,null,null,null,null,null,null,null,null,"ZOEKEN IN KOLOM",null,null,null,null,null,null,null,null,null,"GESLACHT","LEEFTIJD","GEWICHT","CATEGORIE","POULE","Aantal poule's","CATEGORIE CONTROLE MET INSCHRIJFFORMULIER","Application.ScreenUpdating = False"]
[{"$f":"IF($I$2>0,0,0)","v":0},"DAG",null,"GEB DATUM",null,null,null,null,null,null,"CODE","Jaar",null,"GESLACHT",null,"LEEFTIJDSCATEGORIE",1,2,3,4,5,6,7,8,9,null,"JONGENS","-8 JAAR"," -18 KG.",{"$f":"CONCATENATE(AA5,\"/\",AB5,\"/\",AC5)","v":"JONGENS/-8 JAAR/ -18 KG."},101,1,"JONGENS/-8 JAAR/ -18 KG.","Application.CutCopyMode = False"]
[{"$f":"IF($C$5>1,0,0)","v":0},"MAAND",null,null,null,null,null,null,null,null,1,1958,{"$f":"CONCATENATE(2,\"-\",L6)","v":"2-1958"},"MAN","HEREN","+21 JAAR"," -60 KG."," -66 KG."," -73 KG."," -81 KG."," -90 KG."," -100 KG."," +100 KG.",null,null,null,"JONGENS","-8 JAAR"," -21 KG.",{"$f":"CONCATENATE(AA6,\"/\",AB6,\"/\",AC6)","v":"JONGENS/-8 JAAR/ -21 KG."},102,2,"JONGENS/-8 JAAR/ -21 KG."]
[{"$f":"IF($C$6>1,0,0)","v":0},"GEB.JAAR",null,{"$f":"IF(ISERROR(VLOOKUP($C$7,$K$6:$L$60,2,FALSE)),\"\",VLOOKUP($C$7,$K$6:$L$60,2,FALSE))","v":""},{"$f":"CONCATENATE('GEGEVENS-1'!C5,\"-\",'GEGEVENS-1'!C6,\"-\",'GEGEVENS-1'!D7)","v":"--"},null,null,null,null,null,2,1959,{"$f":"CONCATENATE(2,\"-\",L7)","v":"2-1959"},"MAN","HEREN","+21 JAAR"," -60 KG."," -66 KG."," -73 KG."," -81 KG."," -90 KG."," -100 KG."," +100 KG.",null,null,null,"JONGENS","-8 JAAR"," -24 KG.","JONGENS/-8 JAAR/ -24 KG.",103,3,"JONGENS/-8 JAAR/ -24 KG."]
[{"$f":"IF($C$7>1,1,0)","v":0},"GESLACHT",null,{"$f":"CONCATENATE('GEGEVENS-1'!$C$8,\"-\",'GEGEVENS-1'!$D$7)","v":"-"},null,null,null,null,null,null,3,1960,"2-1960","MAN","HEREN","+21 JAAR"," -60 KG."," -66 KG."," -73 KG."," -81 KG."," -90 KG."," -100 KG."," +100 KG.",null,null,null,"JONGENS","-8 JAAR"," -27 KG.","JONGENS/-8 JAAR/ -27 KG.",104,4,"JONGENS/-8 JAAR/ -27 KG."]
[{"$f":"IF($C$8>1,1,0)","v":0},"GEWICHT",null,{"$f":"$C$26","v":""},null,null,null,null,null,null,4,1961,"2-1961","MAN","HEREN","+21 JAAR"," -60 KG."," -66 KG."," -73 KG."," -81 KG."," -90 KG."," -100 KG."," +100 KG.",null,null,null,"JONGENS","-8 JAAR"," -30 KG.","JONGENS/-8 JAAR/ -30 KG.",105,5,"JONGENS/-8 JAAR/ -30 KG."]
[{"$f":"IF($C$9>1,1,0)","v":0},"GRADUATIE",null,{"$f":"$C$39","v":""},null,null,null,null,null,null,5,1962,"2-1962","MAN","HEREN","+21 JAAR"," -60 KG."," -66 KG."," -73 KG."," -81 KG."," -90 KG."," -100 KG."," +100 KG.",null,null,null,"JONGENS","-8 JAAR"," -34 KG.","JONGENS/-8 JAAR/ -34 KG.",106,6,"JONGENS/-8 JAAR/ -34 KG."]
[{"$f":"A7","v":0},"ERVARING",{"$f":"C7","v":0},{"$f":"$C$68","v":""},null,null,null,null,null,null,6,1963,"2-1963","MAN","HEREN","+21 JAAR"," -60 KG."," -66 KG."," -73 KG."," -81 KG."," -90 KG."," -100 KG."," +100 KG.",null,null,null,"JONGENS","-8 JAAR"," -38 KG.","JONGENS/-8 JAAR/ -38 KG.",107,7,"JONGENS/-8 JAAR/ -38 KG."]
[null,null,null,null,null,null,null,null,null,null,7,1964,"2-1964","MAN","HEREN","+21 JAAR"," -60 KG."," -66 KG."," -73 KG."," -81 KG."," -90 KG."," -100 KG."," +100 KG.",null,null,null,"JONGENS","-8 JAAR"," +38 KG.","JONGENS/-8 JAAR/ +38 KG.",108,8,"JONGENS/-8 JAAR/ +38 KG."]
[null,null,null,null,null,null,null,null,null,null,8,1965,"2-1965","MAN","HEREN","+21 JAAR"," -60 KG."," -66 KG."," -73 KG."," -81 KG."," -90 KG."," -100 KG."," +100 KG.",null,null,null,"JONGENS","-10 JAAR"," -21 KG.","JONGENS/-10 JAAR/ -21 KG.",109,9,"JONGENS/-10 JAAR/ -21 KG."]
[null,"LEEFTIJDSCATEGORIE",{"$f":"IF(ISERROR(VLOOKUP($D$8,'GEGEVENS-1'!$M$6:$P$115,4,FALSE)),\"\",VLOOKUP($D$8,'GEGEVENS-1'!$M$6:$P$115,4,FALSE))","v":""},{"$f":"IF(ISERROR(VLOOKUP($D$8,'GEGEVENS-1'!$M$6:$O$115,3,FALSE)),\"\",VLOOKUP($D$8,'GEGEVENS-1'!$M$6:$O$115,3,FALSE))","v":""},null,null,null,null,null,null,9,1966,"2-1966","MAN","HEREN","+21 JAAR"," -60 KG."," -66 KG."," -73 KG."," -81 KG."," -90 KG."," -100 KG."," +100 KG.",null,null,null,"JONGENS","-10 JAAR"," -24 KG.","JONGENS/-10 JAAR/ -24 KG.",110,10,"JONGENS/-10 JAAR/ -24 KG."]
[{"$f":"C20","v":""},"CATEGORIE",{"$f":"CONCATENATE($D$14,\"/\",$C$14,\"/\",$C$26)","v":"//"},{"$f":"CONCATENATE(C15,\"(RECREANT)\")","v":"//(RECREANT)"},null,null,{"$f":"IF(ISERROR(VLOOKUP($C$6,F17:G28,2,FALSE)),\"\",VLOOKUP($C$6,$F$18:$G$29,2,FALSE))","v":""},null,null,null,10,1967,"2-1967","MAN","HEREN","+21 JAAR"," -60 KG."," -66 KG."," -73 KG."," -81 KG."," -90 KG."," -100 KG."," +100 KG.",null,null,null,"JONGENS","-10 JAAR"," -27 KG.","JONGENS/-10 JAAR/ -27 KG.",111,11,"JONGENS/-10 JAAR/ -27 KG.",null,null,null,null,null,null,null,null,null,null,null,null,null,null,null,null,null,null,null,null,null,null,null,null,null,null,null,null,null,null,null,0]
[null,"POULE",{"$f":"IF(ISERROR(VLOOKUP($C$15,$AD$5:$AE$119,2,FALSE)),\"\",VLOOKUP($C$15,$AD$5:$AE$199,2,FALSE))","v":""},{"$f":"CONCATENATE(C15,\"(ERVAREN)\")","v":"//(ERVAREN)"},null,null,{"$f":"IF(ISERROR(VLOOKUP($C$6,F18:G29,2,FALSE)),\"\",VLOOKUP($C$6,$F$18:$G$29,2,FALSE))","v":""},null,null,null,11,1968,"2-1968","MAN","HEREN","+21 JAAR"," -60 KG."," -66 KG."," -73 KG."," -81 KG."," -90 KG."," -100 KG."," +100 KG.",null,null,null,"JONGENS","-10 JAAR"," -30 KG.","JONGENS/-10 JAAR/ -30 KG.",112,12,"JONGENS/-10 JAAR/ -30 KG."]
[null,null,null,null,"CODE","DAG","MAAND",null,null,null,12,1969,"2-1969","MAN","HEREN","+21 JAAR"," -60 KG."," -66 KG."," -73 KG."," -81 KG."," -90 KG."," -100 KG."," +100 KG.",null,null,null,"JONGENS","-10 JAAR"," -34 KG.","JONGENS/-10 JAAR/ -34 KG.",113,13,"JONGENS/-10 JAAR/ -34 KG."]
[{"$f":"IF(D7>0,E7,0)","v":"--"},null,null,null,1,"1","JANUARI",null,null,"01",13,1970,"2-1970","MAN","HEREN","+21 JAAR"," -60 KG."," -66 KG."," -73 KG."," -81 KG."," -90 KG."," -100 KG."," +100 KG.",null,null,null,"JONGENS","-10 JAAR"," -38 KG.","JONGENS/-10 JAAR/ -38 KG.",114,14,"JONGENS/-10 JAAR/ -38 KG."]
[null,"GESLACHT",null,null,2,"2","FEBRUARI",null,null,"02",14,1971,"2-1971","MAN","HEREN","+21 JAAR"," -60 KG."," -66 KG."," -73 KG."," -81 KG."," -90 KG."," -100 KG."," +100 KG.",null,null,null,"JONGENS","-10 JAAR"," -42 KG.","JONGENS/-10 JAAR/ -42 KG.",115,15,"JONGENS/-10 JAAR/ -42 KG."]
[null,null,{"$f":"IF(ISERROR(VLOOKUP($D$8,'GEGEVENS-1'!$M$6:$O$115,2,FALSE)),\"\",VLOOKUP($D$8,'GEGEVENS-1'!$M$6:$O$115,2,FALSE))","v":""},null,3,"3","MAART",null,null,"03",15,1972,"2-1972","MAN","HEREN","+21 JAAR"," -60 KG."," -66 KG."," -73 KG."," -81 KG."," -90 KG."," -100 KG."," +100 KG.",null,null,null,"JONGENS","-10 JAAR"," +42 KG.",{"$f":"CONCATENATE(AA20,\"/\",AB20,\"/\",AC20)","v":"JONGENS/-10 JAAR/ +42 KG."},116,16,"JONGENS/-10 JAAR/ +42 KG."]
[null,1,{"$f":"IF('GEGEVENS-1'!$C$7>0,\"GESLACHT\",0)","v":0},null,4,"4","APRIL",null,null,"04",16,1973,"2-1973","MAN","HEREN","+21 JAAR"," -60 KG."," -66 KG."," -73 KG."," -81 KG."," -90 KG."," -100 KG."," +100 KG.",null,null,null,"JONGENS","-12 JAAR"," -24 KG.","JONGENS/-12 JAAR/ -24 KG.",117,17,"JONGENS/-12 JAAR/ -24 KG."]
[null,2,{"$f":"IF(C21>0,\"MAN\",0)","v":0},null,5,"5","MEI",null,null,"05",17,1974,"2-1974","MAN","HEREN","+21 JAAR"," -60 KG."," -66 KG."," -73 KG."," -81 KG."," -90 KG."," -100 KG."," +100 KG.",null,null,null,"JONGENS","-12 JAAR"," -27 KG.","JONGENS/-12 JAAR/ -27 KG.",118,18,"JONGENS/-12 JAAR/ -27 KG."]
[null,3,{"$f":"IF(C21>0,\"VROUW\",0)","v":0},null,6,"6","JUNI",null,null,"06",18,1975,"2-1975","MAN","HEREN","+21 JAAR"," -60 KG."," -66 KG."," -73 KG."," -81 KG."," -90 KG."," -100 KG."," +100 KG.",null,null,null,"JONGENS","-12 JAAR"," -30 KG.","JONGENS/-12 JAAR/ -30 KG.",119,19,"JONGENS/-12 JAAR/ -30 KG."]
[null,null,null,null,7,"7","JULI",null,null,"07",19,1976,"2-1976","MAN","HEREN","+21 JAAR"," -60 KG."," -66 KG."," -73 KG."," -81 KG."," -90 KG."," -100 KG."," +100 KG.",null,null,null,"JONGENS","-12 JAAR"," -34 KG.","JONGENS/-12 JAAR/ -34 KG.",120,20,"JONGENS/-12 JAAR/ -34 KG."]
[null,"GEWICHTSKLASSE",null,null,8,"8","AUGUSTUS",null,null,"08",20,1977,"2-1977","MAN","HEREN","+21 JAAR"," -60 KG."," -66 KG."," -73 KG."," -81 KG."," -90 KG."," -100 KG."," +100 KG.",null,null,null,"JONGENS","-12 JAAR"," -38 KG.","JONGENS/-12 JAAR/ -38 KG.",121,21,"JONGENS/-12 JAAR/ -38 KG."]
[null,null,{"$f":"IF(ISERROR(VLOOKUP($C$9,$B$27:$C$36,2,FALSE)),\"\",VLOOKUP($C$9,$B$27:$C$36,2,FALSE))","v":""},null,9,"9","SEPTEMBER",null,null,"09",21,1978,"2-1978","MAN","HEREN","+21 JAAR"," -60 KG."," -66 KG."," -73 KG."," -81 KG."," -90 KG."," -100 KG."," +100 KG.",null,null,null,"JONGENS","-12 JAAR"," -42 KG.","JONGENS/-12 JAAR/ -42 KG.",122,22,"JONGENS/-12 JAAR/ -42 KG."]
[null,1,{"$f":"IF($C$8>1,\"GEWICHT\",0)","v":0},null,10,"10","OKTOBER",null,null,"10",22,1979,"2-1979","MAN","HEREN","+21 JAAR"," -60 KG."," -66 KG."," -73 KG."," -81 KG."," -90 KG."," -100 KG."," +100 KG.",null,null,null,"JONGENS","-12 JAAR"," -46 KG.","JONGENS/-12 JAAR/ -46 KG.",123,23,"JONGENS/-12 JAAR/ -46 KG."]
[null,2,{"$f":"IF(ISERROR(VLOOKUP($D$8,$M$6:$Y$115,5,FALSE)),\"\",VLOOKUP($D$8,'GEGEVENS-1'!$M$6:$Y$115,5,FALSE))","v":""},null,11,"11","NOVEMBER",null,null,"11",23,1980,"2-1980","MAN","HEREN","+21 JAAR"," -60 KG."," -66 KG."," -73 KG."," -81 KG."," -90 KG."," -100 KG."," +100 KG.",null,null,null,"JONGENS","-12 JAAR"," -50 KG.","JONGENS/-12 JAAR/ -50 KG.",124,24,"JONGENS/-12 JAAR/ -50 KG."]
[null,3,{"$f":"IF(ISERROR(VLOOKUP($D$8,$M$6:$Y$115,6,FALSE)),\"\",VLOOKUP($D$8,'GEGEVENS-1'!$M$6:$Y$115,6,FALSE))","v":""},null,12,"12","DECEMBER",null,null,"12",24,1981,"2-1981","MAN","HEREN","+21 JAAR"," -60 KG."," -66 KG."," -73 KG."," -81 KG."," -90 KG."," -100 KG."," +100 KG.",null,null,null,"JONGENS","-12 JAAR"," +50 KG.","JONGENS/-12 JAAR/ +50 KG.",125,25,"JONGENS/-12 JAAR/ +50 KG."]
[null,4,{"$f":"IF(ISERROR(VLOOKUP($D$8,$M$6:$Y$115,7,FALSE)),\"\",VLOOKUP($D$8,'GEGEVENS-1'!$M$6:$Y$115,7,FALSE))","v":""},null,13,"13",null,null,null,null,25,1982,"2-1982","MAN","HEREN","+21 JAAR"," -60 KG."," -66 KG."," -73 KG."," -81 KG."," -90 KG."," -100 KG."," +100 KG.",null,null,null,"JONGENS","-15 JAAR"," -34 KG.","JONGENS/-15 JAAR/ -34 KG.",126,26,"JONGENS/-15 JAAR/ -34 KG."]
[null,5,{"$f":"IF(ISERROR(VLOOKUP($D$8,$M$6:$Y$115,8,FALSE)),\"\",VLOOKUP($D$8,'GEGEVENS-1'!$M$6:$Y$115,8,FALSE))","v":""},null,14,"14",null,null,null,null,26,1983,"2-1983","MAN","HEREN","+21 JAAR"," -60 KG."," -66 KG."," -73 KG."," -81 KG."," -90 KG."," -100 KG."," +100 KG.",null,null,null,"JONGENS","-15 JAAR"," -38 KG.","JONGENS/-15 JAAR/ -38 KG.",127,27,"JONGENS/-15 JAAR/ -38 KG."]
[null,6,{"$f":"IF(ISERROR(VLOOKUP($D$8,$M$6:$Y$115,9,FALSE)),\"\",VLOOKUP($D$8,'GEGEVENS-1'!$M$6:$Y$115,9,FALSE))","v":""},null,15,"15",null,null,null,null,27,1984,"2-1984","MAN","HEREN","+21 JAAR"," -60 KG."," -66 KG."," -73 KG."," -81 KG."," -90 KG."," -100 KG."," +100 KG.",null,null,null,"JONGENS","-15 JAAR"," -42 KG.","JONGENS/-15 JAAR/ -42 KG.",128,28,"JONGENS/-15 JAAR/ -42 KG."]
[null,7,{"$f":"IF(ISERROR(VLOOKUP($D$8,$M$6:$Y$115,10,FALSE)),\"\",VLOOKUP($D$8,'GEGEVENS-1'!$M$6:$Y$115,10,FALSE))","v":""},null,16,"16",null,null,null,null,28,1985,"2-1985","MAN","HEREN","+21 JAAR"," -60 KG."," -66 KG."," -73 KG."," -81 KG."," -90 KG."," -100 KG."," +100 KG.",null,null,null,"JONGENS","-15 JAAR"," -46 KG.","JONGENS/-15 JAAR/ -46 KG.",129,29,"JONGENS/-15 JAAR/ -46 KG."]
[null,8,{"$f":"IF(ISERROR(VLOOKUP($D$8,$M$6:$Y$115,11,FALSE)),\"\",VLOOKUP($D$8,'GEGEVENS-1'!$M$6:$Y$115,11,FALSE))","v":""},null,17,"17",null,null,null,null,29,1986,"2-1986","MAN","HEREN","+21 JAAR"," -60 KG."," -66 KG."," -73 KG."," -81 KG."," -90 KG."," -100 KG."," +100 KG.",null,null,null,"JONGENS","-15 JAAR"," -50 KG.","JONGENS/-15 JAAR/ -50 KG.",130,30,"JONGENS/-15 JAAR/ -50 KG."]
[null,9,{"$f":"IF(ISERROR(VLOOKUP($D$8,$M$6:$Y$115,12,FALSE)),\"\",VLOOKUP($D$8,'GEGEVENS-1'!$M$6:$Y$115,12,FALSE))","v":""},null,18,"18",null,null,null,null,30,1987,"2-1987","MAN","HEREN","+21 JAAR"," -60 KG."," -66 KG."," -73 KG."," -81 KG."," -90 KG."," -100 KG."," +100 KG.",null,null,null,"JONGENS","-15 JAAR"," -55 KG.","JONGENS/-15 JAAR/ -55 KG.",131,31,"JONGENS/-15 JAAR/ -55 KG."]
[null,10,{"$f":"IF(ISERROR(VLOOKUP($D$8,$M$6:$Y$115,13,FALSE)),\"\",VLOOKUP($D$8,'GEGEVENS-1'!$M$6:$Y$115,13,FALSE))","v":""},null,19,"19",null,null,null,null,31,1988,"2-1988","MAN","HEREN","+21 JAAR"," -60 KG."," -66 KG."," -73 KG."," -81 KG."," -90 KG."," -100 KG."," +100 KG.",null,null,null,"JONGENS","-15 JAAR"," -60 KG.","JONGENS/-15 JAAR/ -60 KG.",132,32,"JONGENS/-15 JAAR/ -60 KG."]
[null,null,null,null,20,"20",null,null,null,null,32,1989,"2-1989","MAN","HEREN","+21 JAAR"," -60 KG."," -66 KG."," -73 KG."," -81 KG."," -90 KG."," -100 KG."," +100 KG.",null,null,null,"JONGENS","-15 JAAR"," -66 KG.","JONGENS/-15 JAAR/ -66 KG.",133,33,"JONGENS/-15 JAAR/ -66 KG."]
[null,"GRADUATIE",null,null,21,"21",null,null,null,null,33,1990,"2-1990","MAN","HEREN","+21 JAAR"," -60 KG."," -66 KG."," -73 KG."," -81 KG."," -90 KG."," -100 KG."," +100 KG.",null,null,null,"JONGENS","-15 JAAR"," +66 KG.","JONGENS/-15 JAAR/ +66 KG.",134,34,"JONGENS/-15 JAAR/ +66 KG."]
[null,null,{"$f":"IF(ISERROR(VLOOKUP($C$10,$B$40:$C$51,2,FALSE)),\"\",VLOOKUP($C$10,B40:C51,2,FALSE))","v":""},null,22,"22",null,null,null,null,34,1991,"2-1991","MAN","HEREN","+21 JAAR"," -60 KG."," -66 KG."," -73 KG."," -81 KG."," -90 KG."," -100 KG."," +100 KG.",null,null,null,"JONGENS","-18 JAAR"," -46 KG.","JONGENS/-18 JAAR/ -46 KG.",135,35,"JONGENS/-18 JAAR/ -46 KG."]
[null,1,{"$f":"IF($C$9>1,$D$40,0)","v":0},{"$f":"IF('GEGEVENS-1'!$C$8>1,\"GRADUATIE\",0)","v":0},23,"23",null,null,null,null,35,1992,"2-1992","MAN","HEREN","+21 JAAR"," -60 KG."," -66 KG."," -73 KG."," -81 KG."," -90 KG."," -100 KG."," +100 KG.",null,null,null,"JONGENS","-18 JAAR"," -50 KG.","JONGENS/-18 JAAR/ -50 KG.",136,36,"JONGENS/-18 JAAR/ -50 KG."]
[null,2,{"$f":"IF($C$40>0,$D$41,0)","v":0},"6E KYU (WIT)",24,"24",null,null,null,null,36,1993,"2-1993","MAN","HEREN","+21 JAAR"," -60 KG."," -66 KG."," -73 KG."," -81 KG."," -90 KG."," -100 KG."," +100 KG.",null,null,null,"JONGENS","-18 JAAR"," -55 KG.","JONGENS/-18 JAAR/ -55 KG.",137,37,"JONGENS/-18 JAAR/ -55 KG."]
[null,3,{"$f":"IF($C$40>0,$D$42,0)","v":0},"5E KYU (GEEL)",25,"25",null,null,null,null,37,1994,"2-1994","MAN","HEREN","+21 JAAR"," -60 KG."," -66 KG."," -73 KG."," -81 KG."," -90 KG."," -100 KG."," +100 KG.",null,null,null,"JONGENS","-18 JAAR"," -60 KG.","JONGENS/-18 JAAR/ -60 KG.",138,38,"JONGENS/-18 JAAR/ -60 KG."]
[null,4,{"$f":"IF($C$40>0,$D$43,0)","v":0},"4E KYU (ORANJE)",26,"26",null,null,null,null,38,1995,"2-1995","MAN","HEREN","+21 JAAR"," -60 KG."," -66 KG."," -73 KG."," -81 KG."," -90 KG."," -100 KG."," +100 KG.",null,null,null,"JONGENS","-18 JAAR"," -66 KG.","JONGENS/-18 JAAR/ -66 KG.",139,39,"JONGENS/-18 JAAR/ -66 KG."]
[null,5,{"$f":"IF($C$40>0,$D$44,0)","v":0},"3E KYU (GROEN)",27,"27",null,null,null,null,39,1996,"2-1996","MAN","HEREN","+21 JAAR"," -60 KG."," -66 KG."," -73 KG."," -81 KG."," -90 KG."," -100 KG."," +100 KG.",null,null,null,"JONGENS","-18 JAAR"," -73 KG.","JONGENS/-18 JAAR/ -73 KG.",140,40,"JONGENS/-18 JAAR/ -73 KG."]
[null,6,{"$f":"IF($C$40>0,$D$45,0)","v":0},"2E KYU (BLAUW",28,"28",null,null,null,null,40,1997,"2-1997","MAN","HEREN","+21 JAAR"," -60 KG."," -66 KG."," -73 KG."," -81 KG."," -90 KG."," -100 KG."," +100 KG.",null,null,null,"JONGENS","-18 JAAR"," -81 KG.","JONGENS/-18 JAAR/ -81 KG.",141,41,"JONGENS/-18 JAAR/ -81 KG."]
[null,7,{"$f":"IF($C$40>0,$D$46,0)","v":0},"1E KYU (BRUIN)",29,"29",null,null,null,null,41,1998,"2-1998","MAN","HEREN","-21 JAAR"," -55 KG."," -60 KG."," -66 KG."," -73 KG."," -81 KG."," -90 KG."," -100 KG."," +100 KG.",null,null,"JONGENS","-18 JAAR"," -90 KG.","JONGENS/-18 JAAR/ -90 KG.",142,42,"JONGENS/-18 JAAR/ -90 KG."]
[null,8,{"$f":"IF($C$40>0,$D$47,0)","v":0},"1E DAN (ZWART)",30,"30",null,null,null,null,42,1999,"2-1999","MAN","HEREN","-21 JAAR"," -55 KG."," -60 KG."," -66 KG."," -73 KG."," -81 KG."," -90 KG."," -100 KG."," +100 KG.",null,null,"JONGENS","-18 JAAR"," +90 KG.","JONGENS/-18 JAAR/ +90 KG.",143,43,"JONGENS/-18 JAAR/ +90 KG."]
[null,9,{"$f":"IF($C$40>0,$D$48,0)","v":0},"2E DAN (ZWART)",31,"31",null,null,null,null,43,2000,"2-2000","MAN","HEREN","-21 JAAR"," -55 KG."," -60 KG."," -66 KG."," -73 KG."," -81 KG."," -90 KG."," -100 KG."," +100 KG.",null,null,"HEREN","-21 JAAR"," -55 KG.","HEREN/-21 JAAR/ -55 KG.",144,44,"HEREN/-21 JAAR/ -55 KG."]
[null,10,{"$f":"IF($C$40>0,$D$49,0)","v":0},"3E DAN (ZWART)",null,null,null,null,null,null,44,2001,"2-2001","JONGEN","JONGENS","-18 JAAR"," -46 KG."," -50 KG."," -55 KG."," -60 KG."," -66 KG."," -73 KG."," -81 KG."," -90 KG."," +90 KG.",null,"HEREN","-21 JAAR"," -60 KG.","HEREN/-21 JAAR/ -60 KG.",145,45,"HEREN/-21 JAAR/ -60 KG."]
[null,11,{"$f":"IF($C$40>0,$D$50,0)","v":0},"4e DAN (ZWART)",null,null,null,null,null,null,45,2002,"2-2002","JONGEN","JONGENS","-18 JAAR"," -46 KG."," -50 KG."," -55 KG."," -60 KG."," -66 KG."," -73 KG."," -81 KG."," -90 KG."," +90 KG.",null,"HEREN","-21 JAAR"," -66 KG.","HEREN/-21 JAAR/ -66 KG.",146,46,"HEREN/-21 JAAR/ -66 KG."]
[null,12,{"$f":"IF($C$40>0,$D$51,0)","v":0},"5e DAN (ZWART)",null,null,null,null,null,null,46,2003,"2-2003","JONGEN","JONGENS","-18 JAAR"," -46 KG."," -50 KG."," -55 KG."," -60 KG."," -66 KG."," -73 KG."," -81 KG."," -90 KG."," +90 KG.",null,"HEREN","-21 JAAR"," -73 KG.","HEREN/-21 JAAR/ -73 KG.",147,47,"HEREN/-21 JAAR/ -73 KG."]
[null,null,null,null,null,null,null,null,null,null,47,2004,"2-2004","JONGEN","JONGENS","-15 JAAR"," -34 KG."," -38 KG."," -42 KG."," -46 KG."," -50 KG."," -55 KG."," -60 KG."," -66 KG."," +66 KG.",null,"HEREN","-21 JAAR"," -81 KG.","HEREN/-21 JAAR/ -81 KG.",148,48,"HEREN/-21 JAAR/ -81 KG."]
[null,null,null,null,null,null,null,null,null,null,48,2005,"2-2005","JONGEN","JONGENS","-15 JAAR"," -34 KG."," -38 KG."," -42 KG."," -46 KG."," -50 KG."," -55 KG."," -60 KG."," -66 KG."," +66 KG.",null,"HEREN","-21 JAAR"," -90 KG.","HEREN/-21 JAAR/ -90 KG.",149,49,"HEREN/-21 JAAR/ -90 KG."]
[null,null,null,null,null,null,null,null,null,null,49,2006,"2-2006","JONGEN","JONGENS","-15 JAAR"," -34 KG."," -38 KG."," -42 KG."," -46 KG."," -50 KG."," -55 KG."," -60 KG."," -66 KG."," +66 KG.",null,"HEREN","-21 JAAR"," -100 KG.","HEREN/-21 JAAR/ -100 KG.",150,50,"HEREN/-21 JAAR/ -100 KG."]
[null,null,null,null,null,null,null,null,null,null,50,2007,"2-2007","JONGEN","JONGENS","-12 JAAR"," -24 KG."," -27 KG."," -30 KG."," -34 KG."," -38 KG."," -42 KG."," -46 KG."," -50 KG."," +50 KG.",null,"HEREN","-21 JAAR"," +100 KG.","HEREN/-21 JAAR/ +100 KG.",151,51,"HEREN/-21 JAAR/ +100 KG."]
[null,null,null,null,null,null,null,null,null,null,51,2008,"2-2008","JONGEN","JONGENS","-12 JAAR"," -24 KG."," -27 KG."," -30 KG."," -34 KG."," -38 KG."," -42 KG."," -46 KG."," -50 KG."," +50 KG.",null,"HEREN","+21 JAAR"," -60 KG.","HEREN/+21 JAAR/ -60 KG.",152,52,"HEREN/+21 JAAR/ -60 KG."]
[null,null,null,null,null,null,null,null,null,null,52,2009,"2-2009","JONGEN","JONGENS","-10 JAAR"," -21 KG."," -24 KG."," -27 KG."," -30 KG."," -34 KG."," -38 KG."," -42 KG."," +42 KG.",null,null,"HEREN","+21 JAAR"," -66 KG.","HEREN/+21 JAAR/ -66 KG.",153,53,"HEREN/+21 JAAR/ -66 KG."]
[null,null,null,null,null,null,null,null,null,null,53,2010,"2-2010","JONGEN","JONGENS","-10 JAAR"," -21 KG."," -24 KG."," -27 KG."," -30 KG."," -34 KG."," -38 KG."," -42 KG."," +42 KG.",null,null,"HEREN","+21 JAAR"," -73 KG.","HEREN/+21 JAAR/ -73 KG.",154,54,"HEREN/+21 JAAR/ -73 KG."]
[null,null,null,null,null,null,null,null,null,null,54,2011,"2-2011","JONGEN","JONGENS","-8 JAAR"," -18 KG."," -21 KG."," -24 KG."," -27 KG."," -30 KG."," -34 KG."," -38 KG."," +38 KG.",null,null,"HEREN","+21 JAAR"," -81 KG.","HEREN/+21 JAAR/ -81 KG.",155,55,"HEREN/+21 JAAR/ -81 KG."]
[null,null,null,null,null,null,null,null,null,null,55,2012,"2-2012","JONGEN","JONGENS","-8 JAAR"," -18 KG."," -21 KG."," -24 KG."," -27 KG."," -30 KG."," -34 KG."," -38 KG."," +38 KG.",null,null,"HEREN","+21 JAAR"," -90 KG.","HEREN/+21 JAAR/ -90 KG.",156,56,"HEREN/+21 JAAR/ -90 KG."]
[null,null,null,null,null,null,null,null,null,null,1,1958,{"$f":"CONCATENATE(3,\"-\",L61)","v":"3-1958"},"VROUW","DAMES","+21 JAAR"," -48 KG."," -52 KG."," -57 KG."," -63 KG."," -70 KG."," -78 KG."," +78 KG.",null,null,null,"HEREN","+21 JAAR"," -100 KG.","HEREN/+21 JAAR/ -100 KG.",157,57,"HEREN/+21 JAAR/ -100 KG."]
[null,null,null,null,null,null,null,null,null,null,2,1959,{"$f":"CONCATENATE(3,\"-\",L62)","v":"3-1959"},"VROUW","DAMES","+21 JAAR"," -48 KG."," -52 KG."," -57 KG."," -63 KG."," -70 KG."," -78 KG."," +78 KG.",null,null,null,"HEREN","+21 JAAR"," +100 KG.","HEREN/+21 JAAR/ +100 KG.",158,58,"HEREN/+21 JAAR/ +100 KG."]
[null,null,null,null,null,null,null,null,null,null,3,1960,"3-1960","VROUW","DAMES","+21 JAAR"," -48 KG."," -52 KG."," -57 KG."," -63 KG."," -70 KG."," -78 KG."," +78 KG.",null,null,null,"MEISJES","-8 JAAR"," -18 KG.","MEISJES/-8 JAAR/ -18 KG.",201,59,"MEISJES/-8 JAAR/ -18 KG."]
[null,null,null,null,null,null,null,null,null,null,4,1961,"3-1961","VROUW","DAMES","+21 JAAR"," -48 KG."," -52 KG."," -57 KG."," -63 KG."," -70 KG."," -78 KG."," +78 KG.",null,null,null,"MEISJES","-8 JAAR"," -20 KG.","MEISJES/-8 JAAR/ -20 KG.",202,60,"MEISJES/-8 JAAR/ -20 KG."]
[null,null,null,null,null,null,null,null,null,null,5,1962,"3-1962","VROUW","DAMES","+21 JAAR"," -48 KG."," -52 KG."," -57 KG."," -63 KG."," -70 KG."," -78 KG."," +78 KG.",null,null,null,"MEISJES","-8 JAAR"," -22 KG.","MEISJES/-8 JAAR/ -22 KG.",203,61,"MEISJES/-8 JAAR/ -22 KG."]
[null,1,null,null,null,null,null,null,null,null,6,1963,"3-1963","VROUW","DAMES","+21 JAAR"," -48 KG."," -52 KG."," -57 KG."," -63 KG."," -70 KG."," -78 KG."," +78 KG.",null,null,null,"MEISJES","-8 JAAR"," -25 KG.","MEISJES/-8 JAAR/ -25 KG.",204,62,"MEISJES/-8 JAAR/ -25 KG."]
[null,"ERVARINGKLASSE",null,null,null,null,null,null,null,null,7,1964,"3-1964","VROUW","DAMES","+21 JAAR"," -48 KG."," -52 KG."," -57 KG."," -63 KG."," -70 KG."," -78 KG."," +78 KG.",null,null,null,"MEISJES","-8 JAAR"," -28 KG.","MEISJES/-8 JAAR/ -28 KG.",205,63,"MEISJES/-8 JAAR/ -28 KG."]
[null,null,{"$f":"IF(ISERROR(VLOOKUP($C$11,$B$69:$C$70,2,FALSE)),\"\",VLOOKUP($C$11,$B$69:$C$72,2,FALSE))","v":""},null,null,null,null,null,null,null,8,1965,"3-1965","VROUW","DAMES","+21 JAAR"," -48 KG."," -52 KG."," -57 KG."," -63 KG."," -70 KG."," -78 KG."," +78 KG.",null,null,null,"MEISJES","-8 JAAR"," -32 KG.",{"$f":"CONCATENATE(AA68,\"/\",AB68,\"/\",AC68)","v":"MEISJES/-8 JAAR/ -32 KG."},206,64,"MEISJES/-8 JAAR/ -32 KG."]
[null,1,{"$f":"B67","v":"ERVARINGKLASSE"},null,null,null,null,null,null,null,9,1966,"3-1966","VROUW","DAMES","+21 JAAR"," -48 KG."," -52 KG."," -57 KG."," -63 KG."," -70 KG."," -78 KG."," +78 KG.",null,null,null,"MEISJES","-8 JAAR"," -36 KG.","MEISJES/-8 JAAR/ -36 KG.",207,65,"MEISJES/-8 JAAR/ -36 KG."]
[null,2,{"$f":"IF(D7>2001,\"ERVAREN\",\"ERVAREN\")","v":"ERVAREN"},null,null,null,null,null,null,null,10,1967,"3-1967","VROUW","DAMES","+21 JAAR"," -48 KG."," -52 KG."," -57 KG."," -63 KG."," -70 KG."," -78 KG."," +78 KG.",null,null,null,"MEISJES","-8 JAAR","+36 KG.",{"$f":"CONCATENATE(AA70,\"/\",AB70,\"/\",AC70)","v":"MEISJES/-8 JAAR/+36 KG."},208,66,"MEISJES/-8 JAAR/+36 KG."]
[null,3,{"$f":"IF(D7>2002,\"RECREANT\",0)","v":"RECREANT"},null,null,null,null,null,null,null,11,1968,"3-1968","VROUW","DAMES","+21 JAAR"," -48 KG."," -52 KG."," -57 KG."," -63 KG."," -70 KG."," -78 KG."," +78 KG.",null,null,null,"MEISJES","-10 JAAR"," -20 KG.","MEISJES/-10 JAAR/ -20 KG.",209,67,"MEISJES/-10 JAAR/ -20 KG."]
[null,4,{"$f":"IF($C$10>1,\"TOP\",0)","v":0},null,null,null,null,null,null,null,12,1969,"3-1969","VROUW","DAMES","+21 JAAR"," -48 KG."," -52 KG."," -57 KG."," -63 KG."," -70 KG."," -78 KG."," +78 KG.",null,null,null,"MEISJES","-10 JAAR"," -22 KG.",{"$f":"CONCATENATE(AA72,\"/\",AB72,\"/\",AC72)","v":"MEISJES/-10 JAAR/ -22 KG."},210,68,"MEISJES/-10 JAAR/ -22 KG."]
[null,null,null,null,null,null,null,null,null,null,13,1970,"3-1970","VROUW","DAMES","+21 JAAR"," -48 KG."," -52 KG."," -57 KG."," -63 KG."," -70 KG."," -78 KG."," +78 KG.",null,null,null,"MEISJES","-10 JAAR"," -25 KG.","MEISJES/-10 JAAR/ -25 KG.",211,69,"MEISJES/-10 JAAR/ -25 KG."]
[null,{"$f":"IF($C$10>1,\"RECREANT\",0)","v":0},"Voor judoka’s met geen of weinig wedstrijdervaring.",null,null,null,null,null,null,null,14,1971,"3-1971","VROUW","DAMES","+21 JAAR"," -48 KG."," -52 KG."," -57 KG."," -63 KG."," -70 KG."," -78 KG."," +78 KG.",null,null,null,"MEISJES","-10 JAAR"," -28 KG.","MEISJES/-10 JAAR/ -28 KG.",212,70,"MEISJES/-10 JAAR/ -28 KG."]
[null,{"$f":"IF($C$10>1,\"ERVAREN\",0)","v":0},"Voor ervaren wedstrijdjudoka’s.",null,null,null,null,null,null,null,15,1972,"3-1972","VROUW","DAMES","+21 JAAR"," -48 KG."," -52 KG."," -57 KG."," -63 KG."," -70 KG."," -78 KG."," +78 KG.",null,null,null,"MEISJES","-10 JAAR"," -32 KG.","MEISJES/-10 JAAR/ -32 KG.",213,71,"MEISJES/-10 JAAR/ -32 KG."]
[null,{"$f":"IF($C$10>1,\"TOP\",0)","v":0},"Voor judoka’s die regelmatig goed (ruim boven gemiddeld) presteren op zwaardere en gerenommeerde toernooien en op DK’s van de JBN.",null,null,null,null,null,null,null,16,1973,"3-1973","VROUW","DAMES","+21 JAAR"," -48 KG."," -52 KG."," -57 KG."," -63 KG."," -70 KG."," -78 KG."," +78 KG.",null,null,null,"MEISJES","-10 JAAR"," -36 KG.","MEISJES/-10 JAAR/ -36 KG.",214,72,"MEISJES/-10 JAAR/ -36 KG."]
[null,null,null,null,null,null,null,null,null,null,17,1974,"3-1974","VROUW","DAMES","+21 JAAR"," -48 KG."," -52 KG."," -57 KG."," -63 KG."," -70 KG."," -78 KG."," +78 KG.",null,null,null,"MEISJES","-10 JAAR"," -40 KG.","MEISJES/-10 JAAR/ -40 KG.",215,73,"MEISJES/-10 JAAR/ -40 KG."]
[null,null,null,null,null,null,null,null,null,null,18,1975,"3-1975","VROUW","DAMES","+21 JAAR"," -48 KG."," -52 KG."," -57 KG."," -63 KG."," -70 KG."," -78 KG."," +78 KG.",null,null,null,"MEISJES","-10 JAAR","+40 KG.","MEISJES/-10 JAAR/+40 KG.",216,74,"MEISJES/-10 JAAR/+40 KG."]
[null,null,null,null,null,null,null,null,null,null,19,1976,"3-1976","VROUW","DAMES","+21 JAAR"," -48 KG."," -52 KG."," -57 KG."," -63 KG."," -70 KG."," -78 KG."," +78 KG.",null,null,null,"MEISJES","-12 JAAR"," -22 KG.","MEISJES/-12 JAAR/ -22 KG.",217,75,"MEISJES/-12 JAAR/ -22 KG."]
[null,null,null,null,null,null,null,null,null,null,20,1977,"3-1977","VROUW","DAMES","+21 JAAR"," -48 KG."," -52 KG."," -57 KG."," -63 KG."," -70 KG."," -78 KG."," +78 KG.",null,null,null,"MEISJES","-12 JAAR"," -25KG.","MEISJES/-12 JAAR/ -25KG.",218,76,"MEISJES/-12 JAAR/ -25KG."]
[null,null,null,null,null,null,null,null,null,null,21,1978,"3-1978","VROUW","DAMES","+21 JAAR"," -48 KG."," -52 KG."," -57 KG."," -63 KG."," -70 KG."," -78 KG."," +78 KG.",null,null,null,"MEISJES","-12 JAAR"," -28 KG.","MEISJES/-12 JAAR/ -28 KG.",219,77,"MEISJES/-12 JAAR/ -28 KG."]
[null,null,null,null,null,null,null,null,null,null,22,1979,"3-1979","VROUW","DAMES","+21 JAAR"," -48 KG."," -52 KG."," -57 KG."," -63 KG."," -70 KG."," -78 KG."," +78 KG.",null,null,null,"MEISJES","-12 JAAR"," -32 KG.","MEISJES/-12 JAAR/ -32 KG.",220,78,"MEISJES/-12 JAAR/ -32 KG."]
[null,null,null,null,null,null,null,null,null,null,23,1980,"3-1980","VROUW","DAMES","+21 JAAR"," -48 KG."," -52 KG."," -57 KG."," -63 KG."," -70 KG."," -78 KG."," +78 KG.",null,null,null,"MEISJES","-12 JAAR"," -36 KG.","MEISJES/-12 JAAR/ -36 KG.",221,79,"MEISJES/-12 JAAR/ -36 KG."]
[null,null,null,null,null,null,null,null,null,null,24,1981,"3-1981","VROUW","DAMES","+21 JAAR"," -48 KG."," -52 KG."," -57 KG."," -63 KG."," -70 KG."," -78 KG."," +78 KG.",null,null,null,"MEISJES","-12 JAAR"," -40 KG.",{"$f":"CONCATENATE(AA84,\"/\",AB84,\"/\",AC84)","v":"MEISJES/-12 JAAR/ -40 KG."},222,80,"MEISJES/-12 JAAR/ -40 KG."]
[null,null,null,null,null,null,null,null,null,null,25,1982,"3-1982","VROUW","DAMES","+21 JAAR"," -48 KG."," -52 KG."," -57 KG."," -63 KG."," -70 KG."," -78 KG."," +78 KG.",null,null,null,"MEISJES","-12 JAAR"," -44 KG.","MEISJES/-12 JAAR/ -44 KG.",223,81,"MEISJES/-12 JAAR/ -44 KG."]
[null,null,null,null,null,null,null,null,null,null,26,1983,"3-1983","VROUW","DAMES","+21 JAAR"," -48 KG."," -52 KG."," -57 KG."," -63 KG."," -70 KG."," -78 KG."," +78 KG.",null,null,null,"MEISJES","-12 JAAR"," -48 KG.","MEISJES/-12 JAAR/ -48 KG.",224,82,"MEISJES/-12 JAAR/ -48 KG."]
[null,null,null,null,null,null,null,null,null,null,27,1984,"3-1984","VROUW","DAMES","+21 JAAR"," -48 KG."," -52 KG."," -57 KG."," -63 KG."," -70 KG."," -78 KG."," +78 KG.",null,null,null,"MEISJES","-12 JAAR"," +48 KG.","MEISJES/-12 JAAR/ +48 KG.",225,83,"MEISJES/-12 JAAR/ +48 KG."]
[null,null,null,null,null,null,null,null,null,null,28,1985,"3-1985","VROUW","DAMES","+21 JAAR"," -48 KG."," -52 KG."," -57 KG."," -63 KG."," -70 KG."," -78 KG."," +78 KG.",null,null,null,"MEISJES","-15 JAAR"," -32 KG.","MEISJES/-15 JAAR/ -32 KG.",226,84,"MEISJES/-15 JAAR/ -32 KG."]
[null,null,null,null,null,null,null,null,null,null,29,1986,"3-1986","VROUW","DAMES","+21 JAAR"," -48 KG."," -52 KG."," -57 KG."," -63 KG."," -70 KG."," -78 KG."," +78 KG.",null,null,null,"MEISJES","-15 JAAR"," -36 KG.","MEISJES/-15 JAAR/ -36 KG.",227,85,"MEISJES/-15 JAAR/ -36 KG."]
[null,null,null,null,null,null,null,null,null,null,30,1987,"3-1987","VROUW","DAMES","+21 JAAR"," -48 KG."," -52 KG."," -57 KG."," -63 KG."," -70 KG."," -78 KG."," +78 KG.",null,null,null,"MEISJES","-15 JAAR"," -40 KG.","MEISJES/-15 JAAR/ -40 KG.",228,86,"MEISJES/-15 JAAR/ -40 KG."]
[null,null,null,null,null,null,null,null,null,null,31,1988,"3-1988","VROUW","DAMES","+21 JAAR"," -48 KG."," -52 KG."," -57 KG."," -63 KG."," -70 KG."," -78 KG."," +78 KG.",null,null,null,"MEISJES","-15 JAAR"," -44 KG.","MEISJES/-15 JAAR/ -44 KG.",229,87,"MEISJES/-15 JAAR/ -44 KG."]
[null,null,null,null,null,null,null,null,null,null,32,1989,"3-1989","VROUW","DAMES","+21 JAAR"," -48 KG."," -52 KG."," -57 KG."," -63 KG."," -70 KG."," -78 KG."," +78 KG.",null,null,null,"MEISJES","-15 JAAR"," -48 KG.","MEISJES/-15 JAAR/ -48 KG.",230,88,"MEISJES/-15 JAAR/ -48 KG."]
[null,null,null,null,null,null,null,null,null,null,33,1990,"3-1990","VROUW","DAMES","+21 JAAR"," -48 KG."," -52 KG."," -57 KG."," -63 KG."," -70 KG."," -78 KG."," +78 KG.",null,null,null,"MEISJES","-15 JAAR"," -52 KG.","MEISJES/-15 JAAR/ -52 KG.",231,89,"MEISJES/-15 JAAR/ -52 KG."]
[null,null,null,null,null,null,null,null,null,null,34,1991,"3-1991","VROUW","DAMES","+21 JAAR"," -48 KG."," -52 KG."," -57 KG."," -63 KG."," -70 KG."," -78 KG."," +78 KG.",null,null,null,"MEISJES","-15 JAAR"," -57 KG.","MEISJES/-15 JAAR/ -57 KG.",232,90,"MEISJES/-15 JAAR/ -57 KG."]
[null,null,null,null,null,null,null,null,null,null,35,1992,"3-1992","VROUW","DAMES","+21 JAAR"," -48 KG."," -52 KG."," -57 KG."," -63 KG."," -70 KG."," -78 KG."," +78 KG.",null,null,null,"MEISJES","-15 JAAR"," -63 KG.","MEISJES/-15 JAAR/ -63 KG.",233,91,"MEISJES/-15 JAAR/ -63 KG."]
[null,null,null,null,null,null,null,null,null,null,36,1993,"3-1993","VROUW","DAMES","+21 JAAR"," -48 KG."," -52 KG."," -57 KG."," -63 KG."," -70 KG."," -78 KG."," +78 KG.",null,null,null,"MEISJES","-15 JAAR"," +63 KG.","MEISJES/-15 JAAR/ +63 KG.",234,92,"MEISJES/-15 JAAR/ +63 KG."]
[null,null,null,null,null,null,null,null,null,null,37,1994,"3-1994","VROUW","DAMES","+21 JAAR"," -48 KG."," -52 KG."," -57 KG."," -63 KG."," -70 KG."," -78 KG."," +78 KG.",null,null,null,"MEISJES","-18 JAAR","-40 KG.","MEISJES/-18 JAAR/-40 KG.",235,93,"MEISJES/-18 JAAR/-40 KG."]
[null,null,null,null,null,null,null,null,null,null,38,1995,"3-1995","VROUW","DAMES","+21 JAAR"," -48 KG."," -52 KG."," -57 KG."," -63 KG."," -70 KG."," -78 KG."," +78 KG.",null,null,null,"MEISJES","-18 JAAR","-44 KG.","MEISJES/-18 JAAR/-44 KG.",236,94,"MEISJES/-18 JAAR/-44 KG."]
[null,null,null,null,null,null,null,null,null,null,39,1996,"3-1996","VROUW","DAMES","+21 JAAR"," -48 KG."," -52 KG."," -57 KG."," -63 KG."," -70 KG."," -78 KG."," +78 KG.",null,null,null,"MEISJES","-18 JAAR","-48 KG.","MEISJES/-18 JAAR/-48 KG.",237,95,"MEISJES/-18 JAAR/-48 KG."]
[null,null,null,null,null,null,null,null,null,null,40,1997,"3-1997","VROUW","DAMES","+21 JAAR"," -48 KG."," -52 KG."," -57 KG."," -63 KG."," -70 KG."," -78 KG."," +78 KG.",null,null,null,"MEISJES","-18 JAAR","-52 KG.","MEISJES/-18 JAAR/-52 KG.",238,96,"MEISJES/-18 JAAR/-52 KG."]
[null,null,null,null,null,null,null,null,null,null,41,1998,"3-1998","VROUW","DAMES","-21 JAAR"," -44 KG."," -48 KG."," -52 KG."," -57 KG."," -63 KG."," -70 KG."," -78 KG."," +78 KG.",null,null,"MEISJES","-18 JAAR","-57 KG.","MEISJES/-18 JAAR/-57 KG.",239,97,"MEISJES/-18 JAAR/-57 KG."]
[null,null,null,null,null,null,null,null,null,null,42,1999,"3-1999","VROUW","DAMES","-21 JAAR"," -44 KG."," -48 KG."," -52 KG."," -57 KG."," -63 KG."," -70 KG."," -78 KG."," +78 KG.",null,null,"MEISJES","-18 JAAR","-63 KG.","MEISJES/-18 JAAR/-63 KG.",240,98,"MEISJES/-18 JAAR/-63 KG."]
[null,null,null,null,null,null,null,null,null,null,43,2000,"3-2000","VROUW","DAMES","-21 JAAR"," -44 KG."," -48 KG."," -52 KG."," -57 KG."," -63 KG."," -70 KG."," -78 KG."," +78 KG.",null,null,"MEISJES","-18 JAAR","-70 KG.","MEISJES/-18 JAAR/-70 KG.",241,99,"MEISJES/-18 JAAR/-70 KG."]
[null,null,null,null,null,null,null,null,null,null,44,2001,"3-2001","MEISJE","MEISJES","-18 JAAR","-40 KG.","-44 KG.","-48 KG.","-52 KG.","-57 KG.","-63 KG.","-70 KG.","+70 KG.",null,null,"MEISJES","-18 JAAR","+70 KG.","MEISJES/-18 JAAR/+70 KG.",242,100,"MEISJES/-18 JAAR/+70 KG."]
[null,null,null,null,null,null,null,null,null,null,45,2002,"3-2002","MEISJE","MEISJES","-18 JAAR","-40 KG.","-44 KG.","-48 KG.","-52 KG.","-57 KG.","-63 KG.","-70 KG.","+70 KG.",null,null,"DAMES","-21 JAAR"," -44 KG.","DAMES/-21 JAAR/ -44 KG.",243,101,"DAMES/-21 JAAR/ -44 KG."]
[null,null,null,null,null,null,null,null,null,null,46,2003,"3-2003","MEISJE","MEISJES","-18 JAAR","-40 KG.","-44 KG.","-48 KG.","-52 KG.","-57 KG.","-63 KG.","-70 KG.","+70 KG.",null,null,"DAMES","-21 JAAR"," -48 KG.","DAMES/-21 JAAR/ -48 KG.",244,102,"DAMES/-21 JAAR/ -48 KG."]
[null,null,null,null,null,null,null,null,null,null,47,2004,"3-2004","MEISJE","MEISJES","-15 JAAR"," -32 KG."," -36 KG."," -40 KG."," -44 KG."," -48 KG."," -52 KG."," -57 KG."," -63 KG."," +63 KG.",null,"DAMES","-21 JAAR"," -52 KG.","DAMES/-21 JAAR/ -52 KG.",245,103,"DAMES/-21 JAAR/ -52 KG."]
[null,null,null,null,null,null,null,null,null,null,48,2005,"3-2005","MEISJE","MEISJES","-15 JAAR"," -32 KG."," -36 KG."," -40 KG."," -44 KG."," -48 KG."," -52 KG."," -57 KG."," -63 KG."," +63 KG.",null,"DAMES","-21 JAAR"," -57 KG.","DAMES/-21 JAAR/ -57 KG.",246,104,"DAMES/-21 JAAR/ -57 KG."]
[null,null,null,null,null,null,null,null,null,null,49,2006,"3-2006","MEISJE","MEISJES","-15 JAAR"," -32 KG."," -36 KG."," -40 KG."," -44 KG."," -48 KG."," -52 KG."," -57 KG."," -63 KG."," +63 KG.",null,"DAMES","-21 JAAR"," -63 KG.","DAMES/-21 JAAR/ -63 KG.",247,105,"DAMES/-21 JAAR/ -63 KG."]
[null,null,null,null,null,null,null,null,null,null,50,2007,"3-2007","MEISJE","MEISJES","-12 JAAR"," -22 KG."," -25KG."," -28 KG."," -32 KG."," -36 KG."," -40 KG."," -44 KG."," -48 KG."," +48 KG.",null,"DAMES","-21 JAAR"," -70 KG.","DAMES/-21 JAAR/ -70 KG.",248,106,"DAMES/-21 JAAR/ -70 KG."]
[null,null,null,null,null,null,null,null,null,null,51,2008,"3-2008","MEISJE","MEISJES","-12 JAAR"," -22 KG."," -25KG."," -28 KG."," -32 KG."," -36 KG."," -40 KG."," -44 KG."," -48 KG."," +48 KG.",null,"DAMES","-21 JAAR"," -78 KG.","DAMES/-21 JAAR/ -78 KG.",249,107,"DAMES/-21 JAAR/ -78 KG."]
[null,null,null,null,null,null,null,null,null,null,52,2009,"3-2009","MEISJE","MEISJES","-10 JAAR"," -20 KG."," -22 KG."," -25 KG."," -28 KG."," -32 KG."," -36 KG."," -40 KG.","+40 KG.",null,null,"DAMES","-21 JAAR"," +78 KG.","DAMES/-21 JAAR/ +78 KG.",250,108,"DAMES/-21 JAAR/ +78 KG."]
[null,null,null,null,null,null,null,null,null,null,53,2010,"3-2010","MEISJE","MEISJES","-10 JAAR"," -20 KG."," -22 KG."," -25 KG."," -28 KG."," -32 KG."," -36 KG."," -40 KG.","+40 KG.",null,null,"DAMES","+21 JAAR"," -48 KG.","DAMES/+21 JAAR/ -48 KG.",251,109,"DAMES/+21 JAAR/ -48 KG."]
[null,null,null,null,null,null,null,null,null,null,54,2011,"3-2011","MEISJE","MEISJES","-8 JAAR"," -18 KG."," -20 KG."," -22 KG."," -25 KG."," -28 KG."," -32 KG."," -36 KG.","+36 KG.",null,null,"DAMES","+21 JAAR"," -52 KG.","DAMES/+21 JAAR/ -52 KG.",252,110,"DAMES/+21 JAAR/ -52 KG."]
[null,null,null,null,null,null,null,null,null,null,55,2012,"3-2012","MEISJE","MEISJES","-8 JAAR"," -18 KG."," -20 KG."," -22 KG."," -25 KG."," -28 KG."," -32 KG."," -36 KG.","+36 KG.",null,null,"DAMES","+21 JAAR"," -57 KG.","DAMES/+21 JAAR/ -57 KG.",253,111,"DAMES/+21 JAAR/ -57 KG."]
[null,null,null,null,null,null,null,null,null,null,null,null,null,null,null,null,null,null,null,null,null,null,null,null,null,null,"DAMES","+21 JAAR"," -63 KG.","DAMES/+21 JAAR/ -63 KG.",254,112,"DAMES/+21 JAAR/ -63 KG."]
[null,null,null,null,null,null,null,null,null,null,null,null,null,null,null,null,null,null,null,null,null,null,null,null,null,null,"DAMES","+21 JAAR"," -70 KG.","DAMES/+21 JAAR/ -70 KG.",255,113,"DAMES/+21 JAAR/ -70 KG."]
[null,null,null,null,null,null,null,null,null,null,null,null,null,null,null,null,null,null,null,null,null,null,null,null,null,null,"DAMES","+21 JAAR"," -78 KG.","DAMES/+21 JAAR/ -78 KG.",256,114,"DAMES/+21 JAAR/ -78 KG."]
[null,null,null,null,null,null,null,null,null,null,null,null,null,null,null,null,null,null,null,null,null,null,null,null,null,null,"DAMES","+21 JAAR"," +78 KG.","DAMES/+21 JAAR/ +78 KG.",257,115,"DAMES/+21 JAAR/ +78 KG."]

{"sheet":"INVOER JUDOKA'S","index":2,"n_rows":553,"n_cols":62,"rows_kept":553,"cut":false,"hidden":false,"merged":[[23,22,23,31],[0,10,0,13],[23,8,23,10],[8,3,8,4],[9,3,9,4],[10,3,10,4],[3,3,3,4],[4,3,4,4],[5,3,5,4],[6,3,6,4],[7,3,7,4]]}
[null,null,"    INSCHRIJVING JUDOKA'S",null,null,null,null,null,null,null,"Aantal ingeschreven:",null,null,null,null,null,null,{"$f":"SUM(A26:A55)","v":0},null,null,null,null,null,null,null,null,null,null,null,null,null,null,null,null,null,null,null,null,null,null,null,null,null,null,null,null,null,null,null,null,null,{"$f":"NOW()","v":"2023-08-05T18:44:05.080"}]
[]
[]
[null,null,null,null,null,null,null,null,null,null,null,null,null,null,null,null,null,null,null,null,null,null,null,null,null,null,null,{"$f":"IF(ISERROR(VLOOKUP(#REF!,'[4]POULE-INDELING'!$N:$AO,4,FALSE)),\"\",VLOOKUP(#REF!,'[4]POULE-INDELING'!$N:$AO,4,FALSE))","v":""}]
[]
[null,null,null,null,null,null,null,null,null,null,null,null,null,null,null,null,null,null,null,null,null,null,null,null,null,null,null,null,null,null,null,null,null,null,null,null,null,null,null,null,null,null,null,null,null,null,false]
[]
[]
[]
[]
[]
[]
[]
[]
[null,null,null,null,null,null,null,null,null,null,null,{"$f":"SUM(AY:AY)","v":0}]
[]
[]
[]
[]
[]
[]
[]
[]
[null,null,null,null,null,null,null,null,"GEBOORTEDATUM",null,null,null,null,null,null,null,null,null,null,null,null,null,"Recreant aanvinken mogelijk t/m (-15 jaar)"]
[null,null,"Voornaam","Achternaam","JUDOKA","aantal deelnemers","X-NR.","Jbn nr.","Dag","Maand","Jaar","Geb-jaar","Leeftijd-cat","Geslacht","GESLACHT","code v gwkl","GESL.CAT.","GW-Klasse","GW","Graduatie","d","graduatie","Ervaringsklasse",null,"onwaar typ",null,null,null,"CATEGORIE","Categorie","POULE","Poule","judoka","jbn","dag","maand","jaar","geslacht","gew","grad",null,"Sportschool","Adres","Contactpersoon","Email","JBN.NR.","Telefoon","VOORNAAM","ACHTERNAAM","JUDOKA","AANTAL","X-NR.","JBN NR.","GEB.DAT.","GESLACHT","GW","GRADUATIE","ERVARING","CATEGORIE","POULE",null,{"$f":"SUM(BJ26:BJ55)","v":0}]
[{"$f":"IF(AO26=8,F26,0)","v":0},{"$f":"IF(C26>0,BI26,0)","v":0},null,null,{"$f":"CONCATENATE(C26,\" \",D26)","v":" "},{"$f":"IF(AO26=8,1,0)","v":0},null,null,null,null,null,{"$f":"IF(ISERROR(VLOOKUP(K26,'GEGEVENS-2023'!$AE$4:$AF$113,2,FALSE)),\"\",VLOOKUP(K26,'GEGEVENS-2023'!$AE$4:$AF$113,2,FALSE))","v":""},{"$f":"IF(ISERROR(VLOOKUP($P26,'GEGEVENS-2023'!$AG$3:$AJ$113,4,FALSE)),\"\",VLOOKUP($P26,'GEGEVENS-2023'!$AG$3:$AJ$113,4,FALSE))","v":""},null,{"$f":"IF(ISERROR(VLOOKUP($N26,'GEGEVENS-2023'!$A$17:$B$18,2,FALSE)),\"\",VLOOKUP($N26,'GEGEVENS-2023'!$A$17:$B$18,2,FALSE))","v":""},{"$f":"CONCATENATE(N26,\"-\",L26)","v":"-"},{"$f":"IF(ISERROR(VLOOKUP($P26,'GEGEVENS-2023'!$AG$3:$AI$113,3,FALSE)),\"\",VLOOKUP($P26,'GEGEVENS-2023'!$AG$3:$AI$113,3,FALSE))","v":""},null,{"$f":"IF(ISERROR(VLOOKUP(R26,'GEWICHT PER INSCHRIJVING'!$A$2:$AE$10,2,FALSE)),\"\",VLOOKUP(R26,'GEWICHT PER INSCHRIJVING'!$A$2:$AE$10,2,FALSE))","v":""},0,null,{"$f":"IF(ISERROR(VLOOKUP($U26,'GEGEVENS-2023'!$C$18:$D$28,2,FALSE)),\"\",VLOOKUP($U26,'GEGEVENS-2023'!$C$18:$D$28,2,FALSE))","v":""},{"$f":"IF(U26>0,AB26,0)","v":0},null,false,{"$f":"IF($K26>0,\"ervaren\",\"recreant\")","v":"recreant"},{"$f":"IF($K26<10,\"recreant\",\"ervaren\")","v":"recreant"},{"$f":"IF($Y26=TRUE,$AA26,$Z26)","v":"recreant"},{"$f":"CONCATENATE($Q26,\"/\",$M26,\"/\",$S26)","v":"//"},{"$f":"IF(AO26=8,AC26,0)","v":0},{"$f":"IF(ISERROR(VLOOKUP(AC26,'GEGEVENS-2023'!$AX$4:$AY$118,2,FALSE)),\"\",VLOOKUP(AC26,'GEGEVENS-2023'!$AX$4:$AY$118,2,FALSE))","v":""},{"$f":"IF(AD26>0,AE26,0)","v":0},{"$f":"IF(E26>0,1,0)","v":1},{"$f":"IF(H26>0,1,0)","v":0},{"$f":"IF(I26>0,1,0)","v":0},{"$f":"IF(J26>0,1,0)","v":0},{"$f":"IF(K26>0,1,0)","v":0},{"$f":"IF(N26>0,1,0)","v":0},{"$f":"IF(R26>0,1,0)","v":0},{"$f":"IF(U26>0,1,0)","v":0},{"$f":"SUM(AG26:AN26)","v":1},{"$f":"IF($AO26=8,'INSCHRIJVING SPORTSCHOOL'!$D$5,0)","v":0},{"$f":"IF($AP26>0,CONCATENATE('INSCHRIJVING SPORTSCHOOL'!$D$6,\";\",'INSCHRIJVING SPORTSCHOOL'!$D$7,\";\",'INSCHRIJVING SPORTSCHOOL'!$D$8),0)","v":0},{"$f":"IF($AP26>0,'INSCHRIJVING SPORTSCHOOL'!$D$9,0)","v":0},{"$f":"IF($AP26>0,'INSCHRIJVING SPORTSCHOOL'!$D$10,0)","v":0},{"$f":"IF($AP26>0,'INSCHRIJVING SPORTSCHOOL'!$D$11,0)","v":0},{"$f":"IF($AP26>0,'INSCHRIJVING SPORTSCHOOL'!$D$12,0)","v":0},{"$f":"IF($AP26>0,'INVOER JUDOKA''S'!C26,0)","v":0},{"$f":"IF($AP26>0,'INVOER JUDOKA''S'!D26,0)","v":0},{"$f":"IF($AP26>0,'INVOER JUDOKA''S'!E26,0)","v":0},{"$f":"IF($AP26>0,'INVOER JUDOKA''S'!F26,0)","v":0},{"$f":"IF($AP26>0,$AZ$1,0)","v":"00:00:00"},{"$f":"IF($AP26>0,'INVOER JUDOKA''S'!H26,0)","v":0},{"$f":"IF($AP26>0,(CONCATENATE(I26,\"-\",J26,\"-\",L26)),0)","v":0},{"$f":"IF($AP26>0,O26,0)","v":0},{"$f":"IF($AP26>0,S26,0)","v":0},{"$f":"IF($AP26>0,V26,0)","v":0},{"$f":"IF($AP26>0,W26,0)","v":0},{"$f":"IF($AP26>0,AC26,0)","v":0},{"$f":"IF($AP26>0,AE26,0)","v":0},1,{"$f":"IF(AO26=8,1,0)","v":0}]
[0,{"$f":"IF(C27>0,BI27,0)","v":0},null,null," ",{"$f":"IF(AO27=8,1,0)","v":0},null,null,null,null,null,{"$f":"IF(ISERROR(VLOOKUP(K27,'GEGEVENS-2023'!$AE$4:$AF$113,2,FALSE)),\"\",VLOOKUP(K27,'GEGEVENS-2023'!$AE$4:$AF$113,2,FALSE))","v":""},{"$f":"IF(ISERROR(VLOOKUP($P27,'GEGEVENS-2023'!$AG$3:$AJ$113,4,FALSE)),\"\",VLOOKUP($P27,'GEGEVENS-2023'!$AG$3:$AJ$113,4,FALSE))","v":""},null,{"$f":"IF(ISERROR(VLOOKUP($N27,'GEGEVENS-2023'!$A$17:$B$18,2,FALSE)),\"\",VLOOKUP($N27,'GEGEVENS-2023'!$A$17:$B$18,2,FALSE))","v":""},"-",{"$f":"IF(ISERROR(VLOOKUP($P27,'GEGEVENS-2023'!$AG$3:$AI$113,3,FALSE)),\"\",VLOOKUP($P27,'GEGEVENS-2023'!$AG$3:$AI$113,3,FALSE))","v":""},null,{"$f":"IF(ISERROR(VLOOKUP(R27,'GEWICHT PER INSCHRIJVING'!$A$2:$AE$10,3,FALSE)),\"\",VLOOKUP(R27,'GEWICHT PER INSCHRIJVING'!$A$2:$AE$10,3,FALSE))","v":""},0,null,{"$f":"IF(ISERROR(VLOOKUP($U27,'GEGEVENS-2023'!$C$18:$D$28,2,FALSE)),\"\",VLOOKUP($U27,'GEGEVENS-2023'!$C$18:$D$28,2,FALSE))","v":""},0,null,false,{"$f":"IF($K27>0,\"ervaren\",\"recreant\")","v":"recreant"},{"$f":"IF($K27<10,\"recreant\",\"ervaren\")","v":"recreant"},{"$f":"IF($Y27=TRUE,$AA27,$Z27)","v":"recreant"},{"$f":"CONCATENATE($Q27,\"/\",$M27,\"/\",$S27)","v":"//"},{"$f":"IF(AO27=8,AC27,0)","v":0},{"$f":"IF(ISERROR(VLOOKUP(AC27,'GEGEVENS-2023'!$AX$4:$AY$118,2,FALSE)),\"\",VLOOKUP(AC27,'GEGEVENS-2023'!$AX$4:$AY$118,2,FALSE))","v":""},{"$f":"IF(AD27>0,AE27,0)","v":0},{"$f":"IF(E27>0,1,0)","v":1},{"$f":"IF(H27>0,1,0)","v":0},{"$f":"IF(I27>0,1,0)","v":0},{"$f":"IF(J27>0,1,0)","v":0},{"$f":"IF(K27>0,1,0)","v":0},{"$f":"IF(N27>0,1,0)","v":0},{"$f":"IF(R27>0,1,0)","v":0},{"$f":"IF(U27>0,1,0)","v":0},{"$f":"SUM(AG27:AN27)","v":1},{"$f":"IF($AO27=8,'INSCHRIJVING SPORTSCHOOL'!$D$5,0)","v":0},{"$f":"IF($AP27>0,CONCATENATE('INSCHRIJVING SPORTSCHOOL'!$D$6,\";\",'INSCHRIJVING SPORTSCHOOL'!$D$7,\";\",'INSCHRIJVING SPORTSCHOOL'!$D$8),0)","v":0},{"$f":"IF($AP27>0,'INSCHRIJVING SPORTSCHOOL'!$D$9,0)","v":0},{"$f":"IF($AP27>0,'INSCHRIJVING SPORTSCHOOL'!$D$10,0)","v":0},{"$f":"IF($AP27>0,'INSCHRIJVING SPORTSCHOOL'!$D$11,0)","v":0},{"$f":"IF($AP27>0,'INSCHRIJVING SPORTSCHOOL'!$D$12,0)","v":0},{"$f":"IF($AP27>0,'INVOER JUDOKA''S'!C27,0)","v":0},{"$f":"IF($AP27>0,'INVOER JUDOKA''S'!D27,0)","v":0},{"$f":"IF($AP27>0,'INVOER JUDOKA''S'!E27,0)","v":0},{"$f":"IF($AP27>0,'INVOER JUDOKA''S'!F27,0)","v":0},{"$f":"IF($AP27>0,$AZ$1,0)","v":"00:00:00"},{"$f":"IF($AP27>0,'INVOER JUDOKA''S'!H27,0)","v":0},{"$f":"IF($AP27>0,(CONCATENATE(I27,\"-\",J27,\"-\",L27)),0)","v":0},{"$f":"IF($AP27>0,O27,0)","v":0},{"$f":"IF($AP27>0,S27,0)","v":0},{"$f":"IF($AP27>0,V27,0)","v":0},{"$f":"IF($AP27>0,W27,0)","v":0},{"$f":"IF($AP27>0,AC27,0)","v":0},0,2,{"$f":"IF(AO27=8,1,0)","v":0}]
[0,0,null,null," ",0,null,null,null,null,null,{"$f":"IF(ISERROR(VLOOKUP(K28,'GEGEVENS-2023'!$AE$4:$AF$113,2,FALSE)),\"\",VLOOKUP(K28,'GEGEVENS-2023'!$AE$4:$AF$113,2,FALSE))","v":""},{"$f":"IF(ISERROR(VLOOKUP($P28,'GEGEVENS-2023'!$AG$3:$AJ$113,4,FALSE)),\"\",VLOOKUP($P28,'GEGEVENS-2023'!$AG$3:$AJ$113,4,FALSE))","v":""},null,{"$f":"IF(ISERROR(VLOOKUP($N28,'GEGEVENS-2023'!$A$17:$B$18,2,FALSE)),\"\",VLOOKUP($N28,'GEGEVENS-2023'!$A$17:$B$18,2,FALSE))","v":""},"-",{"$f":"IF(ISERROR(VLOOKUP($P28,'GEGEVENS-2023'!$AG$3:$AI$113,3,FALSE)),\"\",VLOOKUP($P28,'GEGEVENS-2023'!$AG$3:$AI$113,3,FALSE))","v":""},null,{"$f":"IF(ISERROR(VLOOKUP(R28,'GEWICHT PER INSCHRIJVING'!$A$2:$AE$10,4,FALSE)),\"\",VLOOKUP(R28,'GEWICHT PER INSCHRIJVING'!$A$2:$AE$10,4,FALSE))","v":""},null,null,{"$f":"IF(ISERROR(VLOOKUP($U28,'GEGEVENS-2023'!$C$18:$D$28,2,FALSE)),\"\",VLOOKUP($U28,'GEGEVENS-2023'!$C$18:$D$28,2,FALSE))","v":""},0,null,false,"recreant","recreant","recreant",{"$f":"CONCATENATE($Q28,\"/\",$M28,\"/\",$S28)","v":"//"},0,{"$f":"IF(ISERROR(VLOOKUP(AC28,'GEGEVENS-2023'!$AX$4:$AY$118,2,FALSE)),\"\",VLOOKUP(AC28,'GEGEVENS-2023'!$AX$4:$AY$118,2,FALSE))","v":""},0,1,0,0,0,0,0,0,0,1,{"$f":"IF($AO28=8,'INSCHRIJVING SPORTSCHOOL'!$D$5,0)","v":0},{"$f":"IF($AP28>0,CONCATENATE('INSCHRIJVING SPORTSCHOOL'!$D$6,\";\",'INSCHRIJVING SPORTSCHOOL'!$D$7,\";\",'INSCHRIJVING SPORTSCHOOL'!$D$8),0)","v":0},{"$f":"IF($AP28>0,'INSCHRIJVING SPORTSCHOOL'!$D$9,0)","v":0},{"$f":"IF($AP28>0,'INSCHRIJVING SPORTSCHOOL'!$D$10,0)","v":0},{"$f":"IF($AP28>0,'INSCHRIJVING SPORTSCHOOL'!$D$11,0)","v":0},{"$f":"IF($AP28>0,'INSCHRIJVING SPORTSCHOOL'!$D$12,0)","v":0},{"$f":"IF($AP28>0,'INVOER JUDOKA''S'!C28,0)","v":0},{"$f":"IF($AP28>0,'INVOER JUDOKA''S'!D28,0)","v":0},{"$f":"IF($AP28>0,'INVOER JUDOKA''S'!E28,0)","v":0},{"$f":"IF($AP28>0,'INVOER JUDOKA''S'!F28,0)","v":0},"00:00:00",{"$f":"IF($AP28>0,'INVOER JUDOKA''S'!H28,0)","v":0},0,0,0,0,0,0,0,3,0]
[0,0,null,null," ",0,null,null,null,null,null,{"$f":"IF(ISERROR(VLOOKUP(K29,'GEGEVENS-2023'!$AE$4:$AF$113,2,FALSE)),\"\",VLOOKUP(K29,'GEGEVENS-2023'!$AE$4:$AF$113,2,FALSE))","v":""},{"$f":"IF(ISERROR(VLOOKUP($P29,'GEGEVENS-2023'!$AG$3:$AJ$113,4,FALSE)),\"\",VLOOKUP($P29,'GEGEVENS-2023'!$AG$3:$AJ$113,4,FALSE))","v":""},null,{"$f":"IF(ISERROR(VLOOKUP($N29,'GEGEVENS-2023'!$A$17:$B$18,2,FALSE)),\"\",VLOOKUP($N29,'GEGEVENS-2023'!$A$17:$B$18,2,FALSE))","v":""},"-",{"$f":"IF(ISERROR(VLOOKUP($P29,'GEGEVENS-2023'!$AG$3:$AI$113,3,FALSE)),\"\",VLOOKUP($P29,'GEGEVENS-2023'!$AG$3:$AI$113,3,FALSE))","v":""},null,{"$f":"IF(ISERROR(VLOOKUP(R29,'GEWICHT PER INSCHRIJVING'!$A$2:$AE$10,5,FALSE)),\"\",VLOOKUP(R29,'GEWICHT PER INSCHRIJVING'!$A$2:$AE$10,5,FALSE))","v":""},null,null,{"$f":"IF(ISERROR(VLOOKUP($U29,'GEGEVENS-2023'!$C$18:$D$28,2,FALSE)),\"\",VLOOKUP($U29,'GEGEVENS-2023'!$C$18:$D$28,2,FALSE))","v":""},0,null,false,"recreant","recreant","recreant","//",0,{"$f":"IF(ISERROR(VLOOKUP(AC29,'GEGEVENS-2023'!$AX$4:$AY$118,2,FALSE)),\"\",VLOOKUP(AC29,'GEGEVENS-2023'!$AX$4:$AY$118,2,FALSE))","v":""},0,1,0,0,0,0,0,0,0,1,{"$f":"IF($AO29=8,'INSCHRIJVING SPORTSCHOOL'!$D$5,0)","v":0},{"$f":"IF($AP29>0,CONCATENATE('INSCHRIJVING SPORTSCHOOL'!$D$6,\";\",'INSCHRIJVING SPORTSCHOOL'!$D$7,\";\",'INSCHRIJVING SPORTSCHOOL'!$D$8),0)","v":0},{"$f":"IF($AP29>0,'INSCHRIJVING SPORTSCHOOL'!$D$9,0)","v":0},{"$f":"IF($AP29>0,'INSCHRIJVING SPORTSCHOOL'!$D$10,0)","v":0},{"$f":"IF($AP29>0,'INSCHRIJVING SPORTSCHOOL'!$D$11,0)","v":0},{"$f":"IF($AP29>0,'INSCHRIJVING SPORTSCHOOL'!$D$12,0)","v":0},{"$f":"IF($AP29>0,'INVOER JUDOKA''S'!C29,0)","v":0},{"$f":"IF($AP29>0,'INVOER JUDOKA''S'!D29,0)","v":0},{"$f":"IF($AP29>0,'INVOER JUDOKA''S'!E29,0)","v":0},{"$f":"IF($AP29>0,'INVOER JUDOKA''S'!F29,0)","v":0},"00:00:00",{"$f":"IF($AP29>0,'INVOER JUDOKA''S'!H29,0)","v":0},0,0,0,0,0,0,0,4,0]
[0,0,null,null," ",0,null,null,null,null,null,{"$f":"IF(ISERROR(VLOOKUP(K30,'GEGEVENS-2023'!$AE$4:$AF$113,2,FALSE)),\"\",VLOOKUP(K30,'GEGEVENS-2023'!$AE$4:$AF$113,2,FALSE))","v":""},{"$f":"IF(ISERROR(VLOOKUP($P30,'GEGEVENS-2023'!$AG$3:$AJ$113,4,FALSE)),\"\",VLOOKUP($P30,'GEGEVENS-2023'!$AG$3:$AJ$113,4,FALSE))","v":""},null,{"$f":"IF(ISERROR(VLOOKUP($N30,'GEGEVENS-2023'!$A$17:$B$18,2,FALSE)),\"\",VLOOKUP($N30,'GEGEVENS-2023'!$A$17:$B$18,2,FALSE))","v":""},"-",{"$f":"IF(ISERROR(VLOOKUP($P30,'GEGEVENS-2023'!$AG$3:$AI$113,3,FALSE)),\"\",VLOOKUP($P30,'GEGEVENS-2023'!$AG$3:$AI$113,3,FALSE))","v":""},null,{"$f":"IF(ISERROR(VLOOKUP(R30,'GEWICHT PER INSCHRIJVING'!$A$2:$AE$10,6,FALSE)),\"\",VLOOKUP(R30,'GEWICHT PER INSCHRIJVING'!$A$2:$AE$10,6,FALSE))","v":""},null,null,{"$f":"IF(ISERROR(VLOOKUP($U30,'GEGEVENS-2023'!$C$18:$D$28,2,FALSE)),\"\",VLOOKUP($U30,'GEGEVENS-2023'!$C$18:$D$28,2,FALSE))","v":""},0,null,false,"recreant","recreant","recreant","//",0,{"$f":"IF(ISERROR(VLOOKUP(AC30,'GEGEVENS-2023'!$AX$4:$AY$118,2,FALSE)),\"\",VLOOKUP(AC30,'GEGEVENS-2023'!$AX$4:$AY$118,2,FALSE))","v":""},0,1,0,0,0,0,0,0,0,1,{"$f":"IF($AO30=8,'INSCHRIJVING SPORTSCHOOL'!$D$5,0)","v":0},{"$f":"IF($AP30>0,CONCATENATE('INSCHRIJVING SPORTSCHOOL'!$D$6,\";\",'INSCHRIJVING SPORTSCHOOL'!$D$7,\";\",'INSCHRIJVING SPORTSCHOOL'!$D$8),0)","v":0},{"$f":"IF($AP30>0,'INSCHRIJVING SPORTSCHOOL'!$D$9,0)","v":0},{"$f":"IF($AP30>0,'INSCHRIJVING SPORTSCHOOL'!$D$10,0)","v":0},{"$f":"IF($AP30>0,'INSCHRIJVING SPORTSCHOOL'!$D$11,0)","v":0},{"$f":"IF($AP30>0,'INSCHRIJVING SPORTSCHOOL'!$D$12,0)","v":0},{"$f":"IF($AP30>0,'INVOER JUDOKA''S'!C30,0)","v":0},{"$f":"IF($AP30>0,'INVOER JUDOKA''S'!D30,0)","v":0},{"$f":"IF($AP30>0,'INVOER JUDOKA''S'!E30,0)","v":0},{"$f":"IF($AP30>0,'INVOER JUDOKA''S'!F30,0)","v":0},"00:00:00",{"$f":"IF($AP30>0,'INVOER JUDOKA''S'!H30,0)","v":0},0,0,0,0,0,0,0,5,0]
[0,0,null,null," ",0,null,null,null,null,null,{"$f":"IF(ISERROR(VLOOKUP(K31,'GEGEVENS-2023'!$AE$4:$AF$113,2,FALSE)),\"\",VLOOKUP(K31,'GEGEVENS-2023'!$AE$4:$AF$113,2,FALSE))","v":""},{"$f":"IF(ISERROR(VLOOKUP($P31,'GEGEVENS-2023'!$AG$3:$AJ$113,4,FALSE)),\"\",VLOOKUP($P31,'GEGEVENS-2023'!$AG$3:$AJ$113,4,FALSE))","v":""},null,{"$f":"IF(ISERROR(VLOOKUP($N31,'GEGEVENS-2023'!$A$17:$B$18,2,FALSE)),\"\",VLOOKUP($N31,'GEGEVENS-2023'!$A$17:$B$18,2,FALSE))","v":""},"-",{"$f":"IF(ISERROR(VLOOKUP($P31,'GEGEVENS-2023'!$AG$3:$AI$113,3,FALSE)),\"\",VLOOKUP($P31,'GEGEVENS-2023'!$AG$3:$AI$113,3,FALSE))","v":""},null,{"$f":"IF(ISERROR(VLOOKUP(R31,'GEWICHT PER INSCHRIJVING'!$A$2:$AE$10,7,FALSE)),\"\",VLOOKUP(R31,'GEWICHT PER INSCHRIJVING'!$A$2:$AE$10,7,FALSE))","v":""},null,null,{"$f":"IF(ISERROR(VLOOKUP($U31,'GEGEVENS-2023'!$C$18:$D$28,2,FALSE)),\"\",VLOOKUP($U31,'GEGEVENS-2023'!$C$18:$D$28,2,FALSE))","v":""},0,null,false,"recreant","recreant","recreant","//",0,{"$f":"IF(ISERROR(VLOOKUP(AC31,'GEGEVENS-2023'!$AX$4:$AY$118,2,FALSE)),\"\",VLOOKUP(AC31,'GEGEVENS-2023'!$AX$4:$AY$118,2,FALSE))","v":""},0,1,0,0,0,0,0,0,0,1,{"$f":"IF($AO31=8,'INSCHRIJVING SPORTSCHOOL'!$D$5,0)","v":0},{"$f":"IF($AP31>0,CONCATENATE('INSCHRIJVING SPORTSCHOOL'!$D$6,\";\",'INSCHRIJVING SPORTSCHOOL'!$D$7,\";\",'INSCHRIJVING SPORTSCHOOL'!$D$8),0)","v":0},{"$f":"IF($AP31>0,'INSCHRIJVING SPORTSCHOOL'!$D$9,0)","v":0},{"$f":"IF($AP31>0,'INSCHRIJVING SPORTSCHOOL'!$D$10,0)","v":0},{"$f":"IF($AP31>0,'INSCHRIJVING SPORTSCHOOL'!$D$11,0)","v":0},{"$f":"IF($AP31>0,'INSCHRIJVING SPORTSCHOOL'!$D$12,0)","v":0},{"$f":"IF($AP31>0,'INVOER JUDOKA''S'!C31,0)","v":0},{"$f":"IF($AP31>0,'INVOER JUDOKA''S'!D31,0)","v":0},{"$f":"IF($AP31>0,'INVOER JUDOKA''S'!E31,0)","v":0},{"$f":"IF($AP31>0,'INVOER JUDOKA''S'!F31,0)","v":0},"00:00:00",{"$f":"IF($AP31>0,'INVOER JUDOKA''S'!H31,0)","v":0},0,0,0,0,0,0,0,6,0]
[0,0,null,null," ",0,null,null,null,null,null,{"$f":"IF(ISERROR(VLOOKUP(K32,'GEGEVENS-2023'!$AE$4:$AF$113,2,FALSE)),\"\",VLOOKUP(K32,'GEGEVENS-2023'!$AE$4:$AF$113,2,FALSE))","v":""},{"$f":"IF(ISERROR(VLOOKUP($P32,'GEGEVENS-2023'!$AG$3:$AJ$113,4,FALSE)),\"\",VLOOKUP($P32,'GEGEVENS-2023'!$AG$3:$AJ$113,4,FALSE))","v":""},null,{"$f":"IF(ISERROR(VLOOKUP($N32,'GEGEVENS-2023'!$A$17:$B$18,2,FALSE)),\"\",VLOOKUP($N32,'GEGEVENS-2023'!$A$17:$B$18,2,FALSE))","v":""},"-",{"$f":"IF(ISERROR(VLOOKUP($P32,'GEGEVENS-2023'!$AG$3:$AI$113,3,FALSE)),\"\",VLOOKUP($P32,'GEGEVENS-2023'!$AG$3:$AI$113,3,FALSE))","v":""},null,{"$f":"IF(ISERROR(VLOOKUP(R32,'GEWICHT PER INSCHRIJVING'!$A$2:$AE$10,8,FALSE)),\"\",VLOOKUP(R32,'GEWICHT PER INSCHRIJVING'!$A$2:$AE$10,8,FALSE))","v":""},null,null,{"$f":"IF(ISERROR(VLOOKUP($U32,'GEGEVENS-2023'!$C$18:$D$28,2,FALSE)),\"\",VLOOKUP($U32,'GEGEVENS-2023'!$C$18:$D$28,2,FALSE))","v":""},0,null,false,"recreant","recreant","recreant","//",0,{"$f":"IF(ISERROR(VLOOKUP(AC32,'GEGEVENS-2023'!$AX$4:$AY$118,2,FALSE)),\"\",VLOOKUP(AC32,'GEGEVENS-2023'!$AX$4:$AY$118,2,FALSE))","v":""},0,{"$f":"IF(E32>0,1,0)","v":1},0,0,0,0,0,0,0,1,{"$f":"IF($AO32=8,'INSCHRIJVING SPORTSCHOOL'!$D$5,0)","v":0},{"$f":"IF($AP32>0,CONCATENATE('INSCHRIJVING SPORTSCHOOL'!$D$6,\";\",'INSCHRIJVING SPORTSCHOOL'!$D$7,\";\",'INSCHRIJVING SPORTSCHOOL'!$D$8),0)","v":0},{"$f":"IF($AP32>0,'INSCHRIJVING SPORTSCHOOL'!$D$9,0)","v":0},{"$f":"IF($AP32>0,'INSCHRIJVING SPORTSCHOOL'!$D$10,0)","v":0},{"$f":"IF($AP32>0,'INSCHRIJVING SPORTSCHOOL'!$D$11,0)","v":0},{"$f":"IF($AP32>0,'INSCHRIJVING SPORTSCHOOL'!$D$12,0)","v":0},{"$f":"IF($AP32>0,'INVOER JUDOKA''S'!C32,0)","v":0},{"$f":"IF($AP32>0,'INVOER JUDOKA''S'!D32,0)","v":0},{"$f":"IF($AP32>0,'INVOER JUDOKA''S'!E32,0)","v":0},{"$f":"IF($AP32>0,'INVOER JUDOKA''S'!F32,0)","v":0},"00:00:00",{"$f":"IF($AP32>0,'INVOER JUDOKA''S'!H32,0)","v":0},0,0,0,0,0,0,0,7,0]
[0,0,null,null," ",0,null,null,null,null,null,{"$f":"IF(ISERROR(VLOOKUP(K33,'GEGEVENS-2023'!$AE$4:$AF$113,2,FALSE)),\"\",VLOOKUP(K33,'GEGEVENS-2023'!$AE$4:$AF$113,2,FALSE))","v":""},{"$f":"IF(ISERROR(VLOOKUP($P33,'GEGEVENS-2023'!$AG$3:$AJ$113,4,FALSE)),\"\",VLOOKUP($P33,'GEGEVENS-2023'!$AG$3:$AJ$113,4,FALSE))","v":""},null,{"$f":"IF(ISERROR(VLOOKUP($N33,'GEGEVENS-2023'!$A$17:$B$18,2,FALSE)),\"\",VLOOKUP($N33,'GEGEVENS-2023'!$A$17:$B$18,2,FALSE))","v":""},"-",{"$f":"IF(ISERROR(VLOOKUP($P33,'GEGEVENS-2023'!$AG$3:$AI$113,3,FALSE)),\"\",VLOOKUP($P33,'GEGEVENS-2023'!$AG$3:$AI$113,3,FALSE))","v":""},null,{"$f":"IF(ISERROR(VLOOKUP(R33,'GEWICHT PER INSCHRIJVING'!$A$2:$AE$10,9,FALSE)),\"\",VLOOKUP(R33,'GEWICHT PER INSCHRIJVING'!$A$2:$AE$10,9,FALSE))","v":""},null,null,{"$f":"IF(ISERROR(VLOOKUP($U33,'GEGEVENS-2023'!$C$18:$D$28,2,FALSE)),\"\",VLOOKUP($U33,'GEGEVENS-2023'!$C$18:$D$28,2,FALSE))","v":""},0,null,false,"recreant","recreant","recreant","//",0,{"$f":"IF(ISERROR(VLOOKUP(AC33,'GEGEVENS-2023'!$AX$4:$AY$118,2,FALSE)),\"\",VLOOKUP(AC33,'GEGEVENS-2023'!$AX$4:$AY$118,2,FALSE))","v":""},0,1,0,0,0,0,0,0,0,1,{"$f":"IF($AO33=8,'INSCHRIJVING SPORTSCHOOL'!$D$5,0)","v":0},{"$f":"IF($AP33>0,CONCATENATE('INSCHRIJVING SPORTSCHOOL'!$D$6,\";\",'INSCHRIJVING SPORTSCHOOL'!$D$7,\";\",'INSCHRIJVING SPORTSCHOOL'!$D$8),0)","v":0},{"$f":"IF($AP33>0,'INSCHRIJVING SPORTSCHOOL'!$D$9,0)","v":0},{"$f":"IF($AP33>0,'INSCHRIJVING SPORTSCHOOL'!$D$10,0)","v":0},{"$f":"IF($AP33>0,'INSCHRIJVING SPORTSCHOOL'!$D$11,0)","v":0},{"$f":"IF($AP33>0,'INSCHRIJVING SPORTSCHOOL'!$D$12,0)","v":0},{"$f":"IF($AP33>0,'INVOER JUDOKA''S'!C33,0)","v":0},{"$f":"IF($AP33>0,'INVOER JUDOKA''S'!D33,0)","v":0},{"$f":"IF($AP33>0,'INVOER JUDOKA''S'!E33,0)","v":0},{"$f":"IF($AP33>0,'INVOER JUDOKA''S'!F33,0)","v":0},"00:00:00",{"$f":"IF($AP33>0,'INVOER JUDOKA''S'!H33,0)","v":0},0,0,0,0,0,0,{"$f":"IF($AP33>0,AE33,0)","v":0},8,0]
[0,0,null,null," ",0,null,null,null,null,null,{"$f":"IF(ISERROR(VLOOKUP(K34,'GEGEVENS-2023'!$AE$4:$AF$113,2,FALSE)),\"\",VLOOKUP(K34,'GEGEVENS-2023'!$AE$4:$AF$113,2,FALSE))","v":""},{"$f":"IF(ISERROR(VLOOKUP($P34,'GEGEVENS-2023'!$AG$3:$AJ$113,4,FALSE)),\"\",VLOOKUP($P34,'GEGEVENS-2023'!$AG$3:$AJ$113,4,FALSE))","v":""},null,{"$f":"IF(ISERROR(VLOOKUP($N34,'GEGEVENS-2023'!$A$17:$B$18,2,FALSE)),\"\",VLOOKUP($N34,'GEGEVENS-2023'!$A$17:$B$18,2,FALSE))","v":""},"-",{"$f":"IF(ISERROR(VLOOKUP($P34,'GEGEVENS-2023'!$AG$3:$AI$113,3,FALSE)),\"\",VLOOKUP($P34,'GEGEVENS-2023'!$AG$3:$AI$113,3,FALSE))","v":""},null,{"$f":"IF(ISERROR(VLOOKUP(R34,'GEWICHT PER INSCHRIJVING'!$A$2:$AE$10,10,FALSE)),\"\",VLOOKUP(R34,'GEWICHT PER INSCHRIJVING'!$A$2:$AE$10,10,FALSE))","v":""},null,null,{"$f":"IF(ISERROR(VLOOKUP($U34,'GEGEVENS-2023'!$C$18:$D$28,2,FALSE)),\"\",VLOOKUP($U34,'GEGEVENS-2023'!$C$18:$D$28,2,FALSE))","v":""},0,null,false,"recreant","recreant","recreant","//",0,{"$f":"IF(ISERROR(VLOOKUP(AC34,'GEGEVENS-2023'!$AX$4:$AY$118,2,FALSE)),\"\",VLOOKUP(AC34,'GEGEVENS-2023'!$AX$4:$AY$118,2,FALSE))","v":""},0,{"$f":"IF(E34>0,1,0)","v":1},{"$f":"IF(H34>0,1,0)","v":0},{"$f":"IF(I34>0,1,0)","v":0},{"$f":"IF(J34>0,1,0)","v":0},{"$f":"IF(K34>0,1,0)","v":0},{"$f":"IF(N34>0,1,0)","v":0},{"$f":"IF(R34>0,1,0)","v":0},{"$f":"IF(U34>0,1,0)","v":0},1,{"$f":"IF($AO34=8,'INSCHRIJVING SPORTSCHOOL'!$D$5,0)","v":0},{"$f":"IF($AP34>0,CONCATENATE('INSCHRIJVING SPORTSCHOOL'!$D$6,\";\",'INSCHRIJVING SPORTSCHOOL'!$D$7,\";\",'INSCHRIJVING SPORTSCHOOL'!$D$8),0)","v":0},{"$f":"IF($AP34>0,'INSCHRIJVING SPORTSCHOOL'!$D$9,0)","v":0},{"$f":"IF($AP34>0,'INSCHRIJVING SPORTSCHOOL'!$D$10,0)","v":0},{"$f":"IF($AP34>0,'INSCHRIJVING SPORTSCHOOL'!$D$11,0)","v":0},{"$f":"IF($AP34>0,'INSCHRIJVING SPORTSCHOOL'!$D$12,0)","v":0},{"$f":"IF($AP34>0,'INVOER JUDOKA''S'!C34,0)","v":0},{"$f":"IF($AP34>0,'INVOER JUDOKA''S'!D34,0)","v":0},{"$f":"IF($AP34>0,'INVOER JUDOKA''S'!E34,0)","v":0},{"$f":"IF($AP34>0,'INVOER JUDOKA''S'!F34,0)","v":0},"00:00:00",{"$f":"IF($AP34>0,'INVOER JUDOKA''S'!H34,0)","v":0},0,0,0,0,0,0,0,9,0]
[0,0,null,null," ",0,null,null,null,null,null,{"$f":"IF(ISERROR(VLOOKUP(K35,'GEGEVENS-2023'!$AE$4:$AF$113,2,FALSE)),\"\",VLOOKUP(K35,'GEGEVENS-2023'!$AE$4:$AF$113,2,FALSE))","v":""},{"$f":"IF(ISERROR(VLOOKUP($P35,'GEGEVENS-2023'!$AG$3:$AJ$113,4,FALSE)),\"\",VLOOKUP($P35,'GEGEVENS-2023'!$AG$3:$AJ$113,4,FALSE))","v":""},null,{"$f":"IF(ISERROR(VLOOKUP($N35,'GEGEVENS-2023'!$A$17:$B$18,2,FALSE)),\"\",VLOOKUP($N35,'GEGEVENS-2023'!$A$17:$B$18,2,FALSE))","v":""},"-",{"$f":"IF(ISERROR(VLOOKUP($P35,'GEGEVENS-2023'!$AG$3:$AI$113,3,FALSE)),\"\",VLOOKUP($P35,'GEGEVENS-2023'!$AG$3:$AI$113,3,FALSE))","v":""},null,{"$f":"IF(ISERROR(VLOOKUP(R35,'GEWICHT PER INSCHRIJVING'!$A$2:$AE$10,11,FALSE)),\"\",VLOOKUP(R35,'GEWICHT PER INSCHRIJVING'!$A$2:$AE$10,11,FALSE))","v":""},null,null,{"$f":"IF(ISERROR(VLOOKUP($U35,'GEGEVENS-2023'!$C$18:$D$28,2,FALSE)),\"\",VLOOKUP($U35,'GEGEVENS-2023'!$C$18:$D$28,2,FALSE))","v":""},0,null,false,"recreant","recreant","recreant","//",0,{"$f":"IF(ISERROR(VLOOKUP(AC35,'GEGEVENS-2023'!$AX$4:$AY$118,2,FALSE)),\"\",VLOOKUP(AC35,'GEGEVENS-2023'!$AX$4:$AY$118,2,FALSE))","v":""},0,{"$f":"IF(E35>0,1,0)","v":1},{"$f":"IF(H35>0,1,0)","v":0},{"$f":"IF(I35>0,1,0)","v":0},{"$f":"IF(J35>0,1,0)","v":0},{"$f":"IF(K35>0,1,0)","v":0},{"$f":"IF(N35>0,1,0)","v":0},{"$f":"IF(R35>0,1,0)","v":0},{"$f":"IF(U35>0,1,0)","v":0},1,{"$f":"IF($AO35=8,'INSCHRIJVING SPORTSCHOOL'!$D$5,0)","v":0},{"$f":"IF($AP35>0,CONCATENATE('INSCHRIJVING SPORTSCHOOL'!$D$6,\";\",'INSCHRIJVING SPORTSCHOOL'!$D$7,\";\",'INSCHRIJVING SPORTSCHOOL'!$D$8),0)","v":0},{"$f":"IF($AP35>0,'INSCHRIJVING SPORTSCHOOL'!$D$9,0)","v":0},{"$f":"IF($AP35>0,'INSCHRIJVING SPORTSCHOOL'!$D$10,0)","v":0},{"$f":"IF($AP35>0,'INSCHRIJVING SPORTSCHOOL'!$D$11,0)","v":0},{"$f":"IF($AP35>0,'INSCHRIJVING SPORTSCHOOL'!$D$12,0)","v":0},{"$f":"IF($AP35>0,'INVOER JUDOKA''S'!C35,0)","v":0},{"$f":"IF($AP35>0,'INVOER JUDOKA''S'!D35,0)","v":0},{"$f":"IF($AP35>0,'INVOER JUDOKA''S'!E35,0)","v":0},{"$f":"IF($AP35>0,'INVOER JUDOKA''S'!F35,0)","v":0},"00:00:00",{"$f":"IF($AP35>0,'INVOER JUDOKA''S'!H35,0)","v":0},0,0,0,0,0,0,0,10,0]
[0,0,null,null," ",0,null,null,null,null,null,{"$f":"IF(ISERROR(VLOOKUP(K36,'GEGEVENS-2023'!$AE$4:$AF$113,2,FALSE)),\"\",VLOOKUP(K36,'GEGEVENS-2023'!$AE$4:$AF$113,2,FALSE))","v":""},{"$f":"IF(ISERROR(VLOOKUP($P36,'GEGEVENS-2023'!$AG$3:$AJ$113,4,FALSE)),\"\",VLOOKUP($P36,'GEGEVENS-2023'!$AG$3:$AJ$113,4,FALSE))","v":""},null,{"$f":"IF(ISERROR(VLOOKUP($N36,'GEGEVENS-2023'!$A$17:$B$18,2,FALSE)),\"\",VLOOKUP($N36,'GEGEVENS-2023'!$A$17:$B$18,2,FALSE))","v":""},"-",{"$f":"IF(ISERROR(VLOOKUP($P36,'GEGEVENS-2023'!$AG$3:$AI$113,3,FALSE)),\"\",VLOOKUP($P36,'GEGEVENS-2023'!$AG$3:$AI$113,3,FALSE))","v":""},null,{"$f":"IF(ISERROR(VLOOKUP(R36,'GEWICHT PER INSCHRIJVING'!$A$2:$AE$10,12,FALSE)),\"\",VLOOKUP(R36,'GEWICHT PER INSCHRIJVING'!$A$2:$AE$10,12,FALSE))","v":""},null,null,{"$f":"IF(ISERROR(VLOOKUP($U36,'GEGEVENS-2023'!$C$18:$D$28,2,FALSE)),\"\",VLOOKUP($U36,'GEGEVENS-2023'!$C$18:$D$28,2,FALSE))","v":""},0,null,false,{"$f":"IF($K36>0,\"ervaren\",\"recreant\")","v":"recreant"},{"$f":"IF($K36<10,\"recreant\",\"ervaren\")","v":"recreant"},{"$f":"IF($Y36=TRUE,$AA36,$Z36)","v":"recreant"},"//",0,{"$f":"IF(ISERROR(VLOOKUP(AC36,'GEGEVENS-2023'!$AX$4:$AY$118,2,FALSE)),\"\",VLOOKUP(AC36,'GEGEVENS-2023'!$AX$4:$AY$118,2,FALSE))","v":""},0,1,0,0,0,0,0,0,0,1,{"$f":"IF($AO36=8,'INSCHRIJVING SPORTSCHOOL'!$D$5,0)","v":0},{"$f":"IF($AP36>0,CONCATENATE('INSCHRIJVING SPORTSCHOOL'!$D$6,\";\",'INSCHRIJVING SPORTSCHOOL'!$D$7,\";\",'INSCHRIJVING SPORTSCHOOL'!$D$8),0)","v":0},{"$f":"IF($AP36>0,'INSCHRIJVING SPORTSCHOOL'!$D$9,0)","v":0},{"$f":"IF($AP36>0,'INSCHRIJVING SPORTSCHOOL'!$D$10,0)","v":0},{"$f":"IF($AP36>0,'INSCHRIJVING SPORTSCHOOL'!$D$11,0)","v":0},{"$f":"IF($AP36>0,'INSCHRIJVING SPORTSCHOOL'!$D$12,0)","v":0},{"$f":"IF($AP36>0,'INVOER JUDOKA''S'!C36,0)","v":0},{"$f":"IF($AP36>0,'INVOER JUDOKA''S'!D36,0)","v":0},{"$f":"IF($AP36>0,'INVOER JUDOKA''S'!E36,0)","v":0},{"$f":"IF($AP36>0,'INVOER JUDOKA''S'!F36,0)","v":0},"00:00:00",{"$f":"IF($AP36>0,'INVOER JUDOKA''S'!H36,0)","v":0},0,0,0,0,0,0,0,11,0]
[0,0,null,null," ",0,null,null,null,null,null,{"$f":"IF(ISERROR(VLOOKUP(K37,'GEGEVENS-2023'!$AE$4:$AF$113,2,FALSE)),\"\",VLOOKUP(K37,'GEGEVENS-2023'!$AE$4:$AF$113,2,FALSE))","v":""},{"$f":"IF(ISERROR(VLOOKUP($P37,'GEGEVENS-2023'!$AG$3:$AJ$113,4,FALSE)),\"\",VLOOKUP($P37,'GEGEVENS-2023'!$AG$3:$AJ$113,4,FALSE))","v":""},null,{"$f":"IF(ISERROR(VLOOKUP($N37,'GEGEVENS-2023'!$A$17:$B$18,2,FALSE)),\"\",VLOOKUP($N37,'GEGEVENS-2023'!$A$17:$B$18,2,FALSE))","v":""},"-",{"$f":"IF(ISERROR(VLOOKUP($P37,'GEGEVENS-2023'!$AG$3:$AI$113,3,FALSE)),\"\",VLOOKUP($P37,'GEGEVENS-2023'!$AG$3:$AI$113,3,FALSE))","v":""},null,{"$f":"IF(ISERROR(VLOOKUP(R37,'GEWICHT PER INSCHRIJVING'!$A$2:$AE$10,13,FALSE)),\"\",VLOOKUP(R37,'GEWICHT PER INSCHRIJVING'!$A$2:$AE$10,13,FALSE))","v":""},null,null,{"$f":"IF(ISERROR(VLOOKUP($U37,'GEGEVENS-2023'!$C$18:$D$28,2,FALSE)),\"\",VLOOKUP($U37,'GEGEVENS-2023'!$C$18:$D$28,2,FALSE))","v":""},0,null,false,"recreant","recreant","recreant","//",0,{"$f":"IF(ISERROR(VLOOKUP(AC37,'GEGEVENS-2023'!$AX$4:$AY$118,2,FALSE)),\"\",VLOOKUP(AC37,'GEGEVENS-2023'!$AX$4:$AY$118,2,FALSE))","v":""},0,1,0,0,0,0,0,0,0,1,{"$f":"IF($AO37=8,'INSCHRIJVING SPORTSCHOOL'!$D$5,0)","v":0},{"$f":"IF($AP37>0,CONCATENATE('INSCHRIJVING SPORTSCHOOL'!$D$6,\";\",'INSCHRIJVING SPORTSCHOOL'!$D$7,\";\",'INSCHRIJVING SPORTSCHOOL'!$D$8),0)","v":0},{"$f":"IF($AP37>0,'INSCHRIJVING SPORTSCHOOL'!$D$9,0)","v":0},{"$f":"IF($AP37>0,'INSCHRIJVING SPORTSCHOOL'!$D$10,0)","v":0},{"$f":"IF($AP37>0,'INSCHRIJVING SPORTSCHOOL'!$D$11,0)","v":0},{"$f":"IF($AP37>0,'INSCHRIJVING SPORTSCHOOL'!$D$12,0)","v":0},{"$f":"IF($AP37>0,'INVOER JUDOKA''S'!C37,0)","v":0},{"$f":"IF($AP37>0,'INVOER JUDOKA''S'!D37,0)","v":0},{"$f":"IF($AP37>0,'INVOER JUDOKA''S'!E37,0)","v":0},{"$f":"IF($AP37>0,'INVOER JUDOKA''S'!F37,0)","v":0},"00:00:00",{"$f":"IF($AP37>0,'INVOER JUDOKA''S'!H37,0)","v":0},0,0,0,0,0,0,0,12,0]
[0,0,null,null," ",0,null,null,null,null,null,{"$f":"IF(ISERROR(VLOOKUP(K38,'GEGEVENS-2023'!$AE$4:$AF$113,2,FALSE)),\"\",VLOOKUP(K38,'GEGEVENS-2023'!$AE$4:$AF$113,2,FALSE))","v":""},{"$f":"IF(ISERROR(VLOOKUP($P38,'GEGEVENS-2023'!$AG$3:$AJ$113,4,FALSE)),\"\",VLOOKUP($P38,'GEGEVENS-2023'!$AG$3:$AJ$113,4,FALSE))","v":""},null,{"$f":"IF(ISERROR(VLOOKUP($N38,'GEGEVENS-2023'!$A$17:$B$18,2,FALSE)),\"\",VLOOKUP($N38,'GEGEVENS-2023'!$A$17:$B$18,2,FALSE))","v":""},"-",{"$f":"IF(ISERROR(VLOOKUP($P38,'GEGEVENS-2023'!$AG$3:$AI$113,3,FALSE)),\"\",VLOOKUP($P38,'GEGEVENS-2023'!$AG$3:$AI$113,3,FALSE))","v":""},null,{"$f":"IF(ISERROR(VLOOKUP(R38,'GEWICHT PER INSCHRIJVING'!$A$2:$AE$10,14,FALSE)),\"\",VLOOKUP(R38,'GEWICHT PER INSCHRIJVING'!$A$2:$AE$10,14,FALSE))","v":""},null,null,{"$f":"IF(ISERROR(VLOOKUP($U38,'GEGEVENS-2023'!$C$18:$D$28,2,FALSE)),\"\",VLOOKUP($U38,'GEGEVENS-2023'!$C$18:$D$28,2,FALSE))","v":""},0,null,false,"recreant","recreant",{"$f":"IF($Y38=TRUE,$AA38,$Z38)","v":"recreant"},"//",0,{"$f":"IF(ISERROR(VLOOKUP(AC38,'GEGEVENS-2023'!$AX$4:$AY$118,2,FALSE)),\"\",VLOOKUP(AC38,'GEGEVENS-2023'!$AX$4:$AY$118,2,FALSE))","v":""},0,1,0,0,0,0,0,0,0,1,{"$f":"IF($AO38=8,'INSCHRIJVING SPORTSCHOOL'!$D$5,0)","v":0},{"$f":"IF($AP38>0,CONCATENATE('INSCHRIJVING SPORTSCHOOL'!$D$6,\";\",'INSCHRIJVING SPORTSCHOOL'!$D$7,\";\",'INSCHRIJVING SPORTSCHOOL'!$D$8),0)","v":0},{"$f":"IF($AP38>0,'INSCHRIJVING SPORTSCHOOL'!$D$9,0)","v":0},{"$f":"IF($AP38>0,'INSCHRIJVING SPORTSCHOOL'!$D$10,0)","v":0},{"$f":"IF($AP38>0,'INSCHRIJVING SPORTSCHOOL'!$D$11,0)","v":0},{"$f":"IF($AP38>0,'INSCHRIJVING SPORTSCHOOL'!$D$12,0)","v":0},{"$f":"IF($AP38>0,'INVOER JUDOKA''S'!C38,0)","v":0},{"$f":"IF($AP38>0,'INVOER JUDOKA''S'!D38,0)","v":0},{"$f":"IF($AP38>0,'INVOER JUDOKA''S'!E38,0)","v":0},{"$f":"IF($AP38>0,'INVOER JUDOKA''S'!F38,0)","v":0},"00:00:00",{"$f":"IF($AP38>0,'INVOER JUDOKA''S'!H38,0)","v":0},0,0,0,0,0,0,0,13,0]
[0,0,null,null," ",0,null,null,null,null,null,{"$f":"IF(ISERROR(VLOOKUP(K39,'GEGEVENS-2023'!$AE$4:$AF$113,2,FALSE)),\"\",VLOOKUP(K39,'GEGEVENS-2023'!$AE$4:$AF$113,2,FALSE))","v":""},{"$f":"IF(ISERROR(VLOOKUP($P39,'GEGEVENS-2023'!$AG$3:$AJ$113,4,FALSE)),\"\",VLOOKUP($P39,'GEGEVENS-2023'!$AG$3:$AJ$113,4,FALSE))","v":""},null,{"$f":"IF(ISERROR(VLOOKUP($N39,'GEGEVENS-2023'!$A$17:$B$18,2,FALSE)),\"\",VLOOKUP($N39,'GEGEVENS-2023'!$A$17:$B$18,2,FALSE))","v":""},"-",{"$f":"IF(ISERROR(VLOOKUP($P39,'GEGEVENS-2023'!$AG$3:$AI$113,3,FALSE)),\"\",VLOOKUP($P39,'GEGEVENS-2023'!$AG$3:$AI$113,3,FALSE))","v":""},null,{"$f":"IF(ISERROR(VLOOKUP(R39,'GEWICHT PER INSCHRIJVING'!$A$2:$AE$10,15,FALSE)),\"\",VLOOKUP(R39,'GEWICHT PER INSCHRIJVING'!$A$2:$AE$10,15,FALSE))","v":""},null,null,{"$f":"IF(ISERROR(VLOOKUP($U39,'GEGEVENS-2023'!$C$18:$D$28,2,FALSE)),\"\",VLOOKUP($U39,'GEGEVENS-2023'!$C$18:$D$28,2,FALSE))","v":""},0,null,false,"recreant","recreant","recreant","//",0,{"$f":"IF(ISERROR(VLOOKUP(AC39,'GEGEVENS-2023'!$AX$4:$AY$118,2,FALSE)),\"\",VLOOKUP(AC39,'GEGEVENS-2023'!$AX$4:$AY$118,2,FALSE))","v":""},0,1,0,0,0,0,0,0,0,1,{"$f":"IF($AO39=8,'INSCHRIJVING SPORTSCHOOL'!$D$5,0)","v":0},{"$f":"IF($AP39>0,CONCATENATE('INSCHRIJVING SPORTSCHOOL'!$D$6,\";\",'INSCHRIJVING SPORTSCHOOL'!$D$7,\";\",'INSCHRIJVING SPORTSCHOOL'!$D$8),0)","v":0},{"$f":"IF($AP39>0,'INSCHRIJVING SPORTSCHOOL'!$D$9,0)","v":0},{"$f":"IF($AP39>0,'INSCHRIJVING SPORTSCHOOL'!$D$10,0)","v":0},{"$f":"IF($AP39>0,'INSCHRIJVING SPORTSCHOOL'!$D$11,0)","v":0},{"$f":"IF($AP39>0,'INSCHRIJVING SPORTSCHOOL'!$D$12,0)","v":0},{"$f":"IF($AP39>0,'INVOER JUDOKA''S'!C39,0)","v":0},{"$f":"IF($AP39>0,'INVOER JUDOKA''S'!D39,0)","v":0},{"$f":"IF($AP39>0,'INVOER JUDOKA''S'!E39,0)","v":0},{"$f":"IF($AP39>0,'INVOER JUDOKA''S'!F39,0)","v":0},"00:00:00",{"$f":"IF($AP39>0,'INVOER JUDOKA''S'!H39,0)","v":0},0,0,0,0,0,0,0,14,0]
[0,0,null,null," ",0,null,null,null,null,null,{"$f":"IF(ISERROR(VLOOKUP(K40,'GEGEVENS-2023'!$AE$4:$AF$113,2,FALSE)),\"\",VLOOKUP(K40,'GEGEVENS-2023'!$AE$4:$AF$113,2,FALSE))","v":""},{"$f":"IF(ISERROR(VLOOKUP($P40,'GEGEVENS-2023'!$AG$3:$AJ$113,4,FALSE)),\"\",VLOOKUP($P40,'GEGEVENS-2023'!$AG$3:$AJ$113,4,FALSE))","v":""},null,{"$f":"IF(ISERROR(VLOOKUP($N40,'GEGEVENS-2023'!$A$17:$B$18,2,FALSE)),\"\",VLOOKUP($N40,'GEGEVENS-2023'!$A$17:$B$18,2,FALSE))","v":""},"-",{"$f":"IF(ISERROR(VLOOKUP($P40,'GEGEVENS-2023'!$AG$3:$AI$113,3,FALSE)),\"\",VLOOKUP($P40,'GEGEVENS-2023'!$AG$3:$AI$113,3,FALSE))","v":""},null,{"$f":"IF(ISERROR(VLOOKUP(R40,'GEWICHT PER INSCHRIJVING'!$A$2:$AE$10,16,FALSE)),\"\",VLOOKUP(R40,'GEWICHT PER INSCHRIJVING'!$A$2:$AE$10,16,FALSE))","v":""},null,null,{"$f":"IF(ISERROR(VLOOKUP($U40,'GEGEVENS-2023'!$C$18:$D$28,2,FALSE)),\"\",VLOOKUP($U40,'GEGEVENS-2023'!$C$18:$D$28,2,FALSE))","v":""},0,null,false,"recreant",{"$f":"IF($K40<10,\"recreant\",\"ervaren\")","v":"recreant"},"recreant","//",0,{"$f":"IF(ISERROR(VLOOKUP(AC40,'GEGEVENS-2023'!$AX$4:$AY$118,2,FALSE)),\"\",VLOOKUP(AC40,'GEGEVENS-2023'!$AX$4:$AY$118,2,FALSE))","v":""},0,1,0,0,0,0,0,0,0,1,{"$f":"IF($AO40=8,'INSCHRIJVING SPORTSCHOOL'!$D$5,0)","v":0},{"$f":"IF($AP40>0,CONCATENATE('INSCHRIJVING SPORTSCHOOL'!$D$6,\";\",'INSCHRIJVING SPORTSCHOOL'!$D$7,\";\",'INSCHRIJVING SPORTSCHOOL'!$D$8),0)","v":0},{"$f":"IF($AP40>0,'INSCHRIJVING SPORTSCHOOL'!$D$9,0)","v":0},{"$f":"IF($AP40>0,'INSCHRIJVING SPORTSCHOOL'!$D$10,0)","v":0},{"$f":"IF($AP40>0,'INSCHRIJVING SPORTSCHOOL'!$D$11,0)","v":0},{"$f":"IF($AP40>0,'INSCHRIJVING SPORTSCHOOL'!$D$12,0)","v":0},{"$f":"IF($AP40>0,'INVOER JUDOKA''S'!C40,0)","v":0},{"$f":"IF($AP40>0,'INVOER JUDOKA''S'!D40,0)","v":0},{"$f":"IF($AP40>0,'INVOER JUDOKA''S'!E40,0)","v":0},{"$f":"IF($AP40>0,'INVOER JUDOKA''S'!F40,0)","v":0},"00:00:00",{"$f":"IF($AP40>0,'INVOER JUDOKA''S'!H40,0)","v":0},0,0,0,0,0,0,0,15,0]
[0,0,null,null," ",0,null,null,null,null,null,{"$f":"IF(ISERROR(VLOOKUP(K41,'GEGEVENS-2023'!$AE$4:$AF$113,2,FALSE)),\"\",VLOOKUP(K41,'GEGEVENS-2023'!$AE$4:$AF$113,2,FALSE))","v":""},{"$f":"IF(ISERROR(VLOOKUP($P41,'GEGEVENS-2023'!$AG$3:$AJ$113,4,FALSE)),\"\",VLOOKUP($P41,'GEGEVENS-2023'!$AG$3:$AJ$113,4,FALSE))","v":""},null,{"$f":"IF(ISERROR(VLOOKUP($N41,'GEGEVENS-2023'!$A$17:$B$18,2,FALSE)),\"\",VLOOKUP($N41,'GEGEVENS-2023'!$A$17:$B$18,2,FALSE))","v":""},"-",{"$f":"IF(ISERROR(VLOOKUP($P41,'GEGEVENS-2023'!$AG$3:$AI$113,3,FALSE)),\"\",VLOOKUP($P41,'GEGEVENS-2023'!$AG$3:$AI$113,3,FALSE))","v":""},null,{"$f":"IF(ISERROR(VLOOKUP(R41,'GEWICHT PER INSCHRIJVING'!$A$2:$AE$10,17,FALSE)),\"\",VLOOKUP(R41,'GEWICHT PER INSCHRIJVING'!$A$2:$AE$10,17,FALSE))","v":""},null,null,{"$f":"IF(ISERROR(VLOOKUP($U41,'GEGEVENS-2023'!$C$18:$D$28,2,FALSE)),\"\",VLOOKUP($U41,'GEGEVENS-2023'!$C$18:$D$28,2,FALSE))","v":""},0,null,false,"recreant","recreant","recreant","//",0,{"$f":"IF(ISERROR(VLOOKUP(AC41,'GEGEVENS-2023'!$AX$4:$AY$118,2,FALSE)),\"\",VLOOKUP(AC41,'GEGEVENS-2023'!$AX$4:$AY$118,2,FALSE))","v":""},0,{"$f":"IF(E41>0,1,0)","v":1},{"$f":"IF(H41>0,1,0)","v":0},{"$f":"IF(I41>0,1,0)","v":0},{"$f":"IF(J41>0,1,0)","v":0},{"$f":"IF(K41>0,1,0)","v":0},{"$f":"IF(N41>0,1,0)","v":0},{"$f":"IF(R41>0,1,0)","v":0},{"$f":"IF(U41>0,1,0)","v":0},1,{"$f":"IF($AO41=8,'INSCHRIJVING SPORTSCHOOL'!$D$5,0)","v":0},{"$f":"IF($AP41>0,CONCATENATE('INSCHRIJVING SPORTSCHOOL'!$D$6,\";\",'INSCHRIJVING SPORTSCHOOL'!$D$7,\";\",'INSCHRIJVING SPORTSCHOOL'!$D$8),0)","v":0},{"$f":"IF($AP41>0,'INSCHRIJVING SPORTSCHOOL'!$D$9,0)","v":0},{"$f":"IF($AP41>0,'INSCHRIJVING SPORTSCHOOL'!$D$10,0)","v":0},{"$f":"IF($AP41>0,'INSCHRIJVING SPORTSCHOOL'!$D$11,0)","v":0},{"$f":"IF($AP41>0,'INSCHRIJVING SPORTSCHOOL'!$D$12,0)","v":0},{"$f":"IF($AP41>0,'INVOER JUDOKA''S'!C41,0)","v":0},{"$f":"IF($AP41>0,'INVOER JUDOKA''S'!D41,0)","v":0},{"$f":"IF($AP41>0,'INVOER JUDOKA''S'!E41,0)","v":0},{"$f":"IF($AP41>0,'INVOER JUDOKA''S'!F41,0)","v":0},"00:00:00",{"$f":"IF($AP41>0,'INVOER JUDOKA''S'!H41,0)","v":0},0,0,0,0,0,0,0,16,0]
[0,0,null,null," ",0,null,null,null,null,null,{"$f":"IF(ISERROR(VLOOKUP(K42,'GEGEVENS-2023'!$AE$4:$AF$113,2,FALSE)),\"\",VLOOKUP(K42,'GEGEVENS-2023'!$AE$4:$AF$113,2,FALSE))","v":""},{"$f":"IF(ISERROR(VLOOKUP($P42,'GEGEVENS-2023'!$AG$3:$AJ$113,4,FALSE)),\"\",VLOOKUP($P42,'GEGEVENS-2023'!$AG$3:$AJ$113,4,FALSE))","v":""},null,{"$f":"IF(ISERROR(VLOOKUP($N42,'GEGEVENS-2023'!$A$17:$B$18,2,FALSE)),\"\",VLOOKUP($N42,'GEGEVENS-2023'!$A$17:$B$18,2,FALSE))","v":""},"-",{"$f":"IF(ISERROR(VLOOKUP($P42,'GEGEVENS-2023'!$AG$3:$AI$113,3,FALSE)),\"\",VLOOKUP($P42,'GEGEVENS-2023'!$AG$3:$AI$113,3,FALSE))","v":""},null,{"$f":"IF(ISERROR(VLOOKUP(R42,'GEWICHT PER INSCHRIJVING'!$A$2:$AE$18,15,FALSE)),\"\",VLOOKUP(R42,'GEWICHT PER INSCHRIJVING'!$A$2:$AE$10,18,FALSE))","v":""},null,null,{"$f":"IF(ISERROR(VLOOKUP($U42,'GEGEVENS-2023'!$C$18:$D$28,2,FALSE)),\"\",VLOOKUP($U42,'GEGEVENS-2023'!$C$18:$D$28,2,FALSE))","v":""},0,null,false,"recreant","recreant","recreant",{"$f":"CONCATENATE($Q42,\"/\",$M42,\"/\",$S42)","v":"//"},0,{"$f":"IF(ISERROR(VLOOKUP(AC42,'GEGEVENS-2023'!$AX$4:$AY$118,2,FALSE)),\"\",VLOOKUP(AC42,'GEGEVENS-2023'!$AX$4:$AY$118,2,FALSE))","v":""},0,1,0,0,0,0,0,0,0,1,{"$f":"IF($AO42=8,'INSCHRIJVING SPORTSCHOOL'!$D$5,0)","v":0},{"$f":"IF($AP42>0,CONCATENATE('INSCHRIJVING SPORTSCHOOL'!$D$6,\";\",'INSCHRIJVING SPORTSCHOOL'!$D$7,\";\",'INSCHRIJVING SPORTSCHOOL'!$D$8),0)","v":0},{"$f":"IF($AP42>0,'INSCHRIJVING SPORTSCHOOL'!$D$9,0)","v":0},{"$f":"IF($AP42>0,'INSCHRIJVING SPORTSCHOOL'!$D$10,0)","v":0},{"$f":"IF($AP42>0,'INSCHRIJVING SPORTSCHOOL'!$D$11,0)","v":0},{"$f":"IF($AP42>0,'INSCHRIJVING SPORTSCHOOL'!$D$12,0)","v":0},{"$f":"IF($AP42>0,'INVOER JUDOKA''S'!C42,0)","v":0},{"$f":"IF($AP42>0,'INVOER JUDOKA''S'!D42,0)","v":0},{"$f":"IF($AP42>0,'INVOER JUDOKA''S'!E42,0)","v":0},{"$f":"IF($AP42>0,'INVOER JUDOKA''S'!F42,0)","v":0},"00:00:00",{"$f":"IF($AP42>0,'INVOER JUDOKA''S'!H42,0)","v":0},0,0,0,0,0,0,0,17,0]
[0,0,null,null," ",0,null,null,null,null,null,{"$f":"IF(ISERROR(VLOOKUP(K43,'GEGEVENS-2023'!$AE$4:$AF$113,2,FALSE)),\"\",VLOOKUP(K43,'GEGEVENS-2023'!$AE$4:$AF$113,2,FALSE))","v":""},{"$f":"IF(ISERROR(VLOOKUP($P43,'GEGEVENS-2023'!$AG$3:$AJ$113,4,FALSE)),\"\",VLOOKUP($P43,'GEGEVENS-2023'!$AG$3:$AJ$113,4,FALSE))","v":""},null,{"$f":"IF(ISERROR(VLOOKUP($N43,'GEGEVENS-2023'!$A$17:$B$18,2,FALSE)),\"\",VLOOKUP($N43,'GEGEVENS-2023'!$A$17:$B$18,2,FALSE))","v":""},"-",{"$f":"IF(ISERROR(VLOOKUP($P43,'GEGEVENS-2023'!$AG$3:$AI$113,3,FALSE)),\"\",VLOOKUP($P43,'GEGEVENS-2023'!$AG$3:$AI$113,3,FALSE))","v":""},null,{"$f":"IF(ISERROR(VLOOKUP(R43,'GEWICHT PER INSCHRIJVING'!$A$2:$AE$10,19,FALSE)),\"\",VLOOKUP(R43,'GEWICHT PER INSCHRIJVING'!$A$2:$AE$10,19,FALSE))","v":""},null,null,{"$f":"IF(ISERROR(VLOOKUP($U43,'GEGEVENS-2023'!$C$18:$D$28,2,FALSE)),\"\",VLOOKUP($U43,'GEGEVENS-2023'!$C$18:$D$28,2,FALSE))","v":""},0,null,false,"recreant","recreant","recreant","//",0,{"$f":"IF(ISERROR(VLOOKUP(AC43,'GEGEVENS-2023'!$AX$4:$AY$118,2,FALSE)),\"\",VLOOKUP(AC43,'GEGEVENS-2023'!$AX$4:$AY$118,2,FALSE))","v":""},0,1,0,0,0,0,0,0,0,1,{"$f":"IF($AO43=8,'INSCHRIJVING SPORTSCHOOL'!$D$5,0)","v":0},{"$f":"IF($AP43>0,CONCATENATE('INSCHRIJVING SPORTSCHOOL'!$D$6,\";\",'INSCHRIJVING SPORTSCHOOL'!$D$7,\";\",'INSCHRIJVING SPORTSCHOOL'!$D$8),0)","v":0},{"$f":"IF($AP43>0,'INSCHRIJVING SPORTSCHOOL'!$D$9,0)","v":0},{"$f":"IF($AP43>0,'INSCHRIJVING SPORTSCHOOL'!$D$10,0)","v":0},{"$f":"IF($AP43>0,'INSCHRIJVING SPORTSCHOOL'!$D$11,0)","v":0},{"$f":"IF($AP43>0,'INSCHRIJVING SPORTSCHOOL'!$D$12,0)","v":0},{"$f":"IF($AP43>0,'INVOER JUDOKA''S'!C43,0)","v":0},{"$f":"IF($AP43>0,'INVOER JUDOKA''S'!D43,0)","v":0},{"$f":"IF($AP43>0,'INVOER JUDOKA''S'!E43,0)","v":0},{"$f":"IF($AP43>0,'INVOER JUDOKA''S'!F43,0)","v":0},"00:00:00",{"$f":"IF($AP43>0,'INVOER JUDOKA''S'!H43,0)","v":0},0,0,0,0,0,0,0,18,0]
[0,0,null,null," ",0,null,null,null,null,null,{"$f":"IF(ISERROR(VLOOKUP(K44,'GEGEVENS-2023'!$AE$4:$AF$113,2,FALSE)),\"\",VLOOKUP(K44,'GEGEVENS-2023'!$AE$4:$AF$113,2,FALSE))","v":""},{"$f":"IF(ISERROR(VLOOKUP($P44,'GEGEVENS-2023'!$AG$3:$AJ$113,4,FALSE)),\"\",VLOOKUP($P44,'GEGEVENS-2023'!$AG$3:$AJ$113,4,FALSE))","v":""},null,{"$f":"IF(ISERROR(VLOOKUP($N44,'GEGEVENS-2023'!$A$17:$B$18,2,FALSE)),\"\",VLOOKUP($N44,'GEGEVENS-2023'!$A$17:$B$18,2,FALSE))","v":""},"-",{"$f":"IF(ISERROR(VLOOKUP($P44,'GEGEVENS-2023'!$AG$3:$AI$113,3,FALSE)),\"\",VLOOKUP($P44,'GEGEVENS-2023'!$AG$3:$AI$113,3,FALSE))","v":""},null,{"$f":"IF(ISERROR(VLOOKUP(R44,'GEWICHT PER INSCHRIJVING'!$A$2:$AE$10,20,FALSE)),\"\",VLOOKUP(R44,'GEWICHT PER INSCHRIJVING'!$A$2:$AE$10,20,FALSE))","v":""},null,null,{"$f":"IF(ISERROR(VLOOKUP($U44,'GEGEVENS-2023'!$C$18:$D$28,2,FALSE)),\"\",VLOOKUP($U44,'GEGEVENS-2023'!$C$18:$D$28,2,FALSE))","v":""},0,null,false,"recreant","recreant","recreant","//",0,{"$f":"IF(ISERROR(VLOOKUP(AC44,'GEGEVENS-2023'!$AX$4:$AY$118,2,FALSE)),\"\",VLOOKUP(AC44,'GEGEVENS-2023'!$AX$4:$AY$118,2,FALSE))","v":""},0,1,0,0,0,0,0,0,0,1,{"$f":"IF($AO44=8,'INSCHRIJVING SPORTSCHOOL'!$D$5,0)","v":0},{"$f":"IF($AP44>0,CONCATENATE('INSCHRIJVING SPORTSCHOOL'!$D$6,\";\",'INSCHRIJVING SPORTSCHOOL'!$D$7,\";\",'INSCHRIJVING SPORTSCHOOL'!$D$8),0)","v":0},{"$f":"IF($AP44>0,'INSCHRIJVING SPORTSCHOOL'!$D$9,0)","v":0},{"$f":"IF($AP44>0,'INSCHRIJVING SPORTSCHOOL'!$D$10,0)","v":0},{"$f":"IF($AP44>0,'INSCHRIJVING SPORTSCHOOL'!$D$11,0)","v":0},{"$f":"IF($AP44>0,'INSCHRIJVING SPORTSCHOOL'!$D$12,0)","v":0},{"$f":"IF($AP44>0,'INVOER JUDOKA''S'!C44,0)","v":0},{"$f":"IF($AP44>0,'INVOER JUDOKA''S'!D44,0)","v":0},{"$f":"IF($AP44>0,'INVOER JUDOKA''S'!E44,0)","v":0},{"$f":"IF($AP44>0,'INVOER JUDOKA''S'!F44,0)","v":0},"00:00:00",{"$f":"IF($AP44>0,'INVOER JUDOKA''S'!H44,0)","v":0},0,0,0,0,0,0,0,19,0]
[0,0,null,null," ",0,null,null,null,null,null,{"$f":"IF(ISERROR(VLOOKUP(K45,'GEGEVENS-2023'!$AE$4:$AF$113,2,FALSE)),\"\",VLOOKUP(K45,'GEGEVENS-2023'!$AE$4:$AF$113,2,FALSE))","v":""},{"$f":"IF(ISERROR(VLOOKUP($P45,'GEGEVENS-2023'!$AG$3:$AJ$113,4,FALSE)),\"\",VLOOKUP($P45,'GEGEVENS-2023'!$AG$3:$AJ$113,4,FALSE))","v":""},null,{"$f":"IF(ISERROR(VLOOKUP($N45,'GEGEVENS-2023'!$A$17:$B$18,2,FALSE)),\"\",VLOOKUP($N45,'GEGEVENS-2023'!$A$17:$B$18,2,FALSE))","v":""},"-",{"$f":"IF(ISERROR(VLOOKUP($P45,'GEGEVENS-2023'!$AG$3:$AI$113,3,FALSE)),\"\",VLOOKUP($P45,'GEGEVENS-2023'!$AG$3:$AI$113,3,FALSE))","v":""},null,{"$f":"IF(ISERROR(VLOOKUP(R45,'GEWICHT PER INSCHRIJVING'!$A$2:$AE$10,21,FALSE)),\"\",VLOOKUP(R45,'GEWICHT PER INSCHRIJVING'!$A$2:$AE$10,21,FALSE))","v":""},null,null,{"$f":"IF(ISERROR(VLOOKUP($U45,'GEGEVENS-2023'!$C$18:$D$28,2,FALSE)),\"\",VLOOKUP($U45,'GEGEVENS-2023'!$C$18:$D$28,2,FALSE))","v":""},0,null,false,"recreant","recreant","recreant","//",0,{"$f":"IF(ISERROR(VLOOKUP(AC45,'GEGEVENS-2023'!$AX$4:$AY$118,2,FALSE)),\"\",VLOOKUP(AC45,'GEGEVENS-2023'!$AX$4:$AY$118,2,FALSE))","v":""},0,1,0,0,0,0,0,0,0,1,{"$f":"IF($AO45=8,'INSCHRIJVING SPORTSCHOOL'!$D$5,0)","v":0},{"$f":"IF($AP45>0,CONCATENATE('INSCHRIJVING SPORTSCHOOL'!$D$6,\";\",'INSCHRIJVING SPORTSCHOOL'!$D$7,\";\",'INSCHRIJVING SPORTSCHOOL'!$D$8),0)","v":0},{"$f":"IF($AP45>0,'INSCHRIJVING SPORTSCHOOL'!$D$9,0)","v":0},{"$f":"IF($AP45>0,'INSCHRIJVING SPORTSCHOOL'!$D$10,0)","v":0},{"$f":"IF($AP45>0,'INSCHRIJVING SPORTSCHOOL'!$D$11,0)","v":0},{"$f":"IF($AP45>0,'INSCHRIJVING SPORTSCHOOL'!$D$12,0)","v":0},{"$f":"IF($AP45>0,'INVOER JUDOKA''S'!C45,0)","v":0},{"$f":"IF($AP45>0,'INVOER JUDOKA''S'!D45,0)","v":0},{"$f":"IF($AP45>0,'INVOER JUDOKA''S'!E45,0)","v":0},{"$f":"IF($AP45>0,'INVOER JUDOKA''S'!F45,0)","v":0},"00:00:00",{"$f":"IF($AP45>0,'INVOER JUDOKA''S'!H45,0)","v":0},0,0,0,0,0,0,0,20,0]
[0,0,null,null," ",0,null,null,null,null,null,{"$f":"IF(ISERROR(VLOOKUP(K46,'GEGEVENS-2023'!$AE$4:$AF$113,2,FALSE)),\"\",VLOOKUP(K46,'GEGEVENS-2023'!$AE$4:$AF$113,2,FALSE))","v":""},{"$f":"IF(ISERROR(VLOOKUP($P46,'GEGEVENS-2023'!$AG$3:$AJ$113,4,FALSE)),\"\",VLOOKUP($P46,'GEGEVENS-2023'!$AG$3:$AJ$113,4,FALSE))","v":""},null,{"$f":"IF(ISERROR(VLOOKUP($N46,'GEGEVENS-2023'!$A$17:$B$18,2,FALSE)),\"\",VLOOKUP($N46,'GEGEVENS-2023'!$A$17:$B$18,2,FALSE))","v":""},"-",{"$f":"IF(ISERROR(VLOOKUP($P46,'GEGEVENS-2023'!$AG$3:$AI$113,3,FALSE)),\"\",VLOOKUP($P46,'GEGEVENS-2023'!$AG$3:$AI$113,3,FALSE))","v":""},null,{"$f":"IF(ISERROR(VLOOKUP(R46,'GEWICHT PER INSCHRIJVING'!$A$2:$AE$10,22,FALSE)),\"\",VLOOKUP(R46,'GEWICHT PER INSCHRIJVING'!$A$2:$AE$10,22,FALSE))","v":""},null,null,{"$f":"IF(ISERROR(VLOOKUP($U46,'GEGEVENS-2023'!$C$18:$D$28,2,FALSE)),\"\",VLOOKUP($U46,'GEGEVENS-2023'!$C$18:$D$28,2,FALSE))","v":""},0,null,false,"recreant","recreant","recreant","//",{"$f":"IF(AO46=8,AC46,0)","v":0},{"$f":"IF(ISERROR(VLOOKUP(AC46,'GEGEVENS-2023'!$AX$4:$AY$118,2,FALSE)),\"\",VLOOKUP(AC46,'GEGEVENS-2023'!$AX$4:$AY$118,2,FALSE))","v":""},0,{"$f":"IF(E46>0,1,0)","v":1},{"$f":"IF(H46>0,1,0)","v":0},{"$f":"IF(I46>0,1,0)","v":0},{"$f":"IF(J46>0,1,0)","v":0},{"$f":"IF(K46>0,1,0)","v":0},{"$f":"IF(N46>0,1,0)","v":0},{"$f":"IF(R46>0,1,0)","v":0},{"$f":"IF(U46>0,1,0)","v":0},1,{"$f":"IF($AO46=8,'INSCHRIJVING SPORTSCHOOL'!$D$5,0)","v":0},{"$f":"IF($AP46>0,CONCATENATE('INSCHRIJVING SPORTSCHOOL'!$D$6,\";\",'INSCHRIJVING SPORTSCHOOL'!$D$7,\";\",'INSCHRIJVING SPORTSCHOOL'!$D$8),0)","v":0},{"$f":"IF($AP46>0,'INSCHRIJVING SPORTSCHOOL'!$D$9,0)","v":0},{"$f":"IF($AP46>0,'INSCHRIJVING SPORTSCHOOL'!$D$10,0)","v":0},{"$f":"IF($AP46>0,'INSCHRIJVING SPORTSCHOOL'!$D$11,0)","v":0},{"$f":"IF($AP46>0,'INSCHRIJVING SPORTSCHOOL'!$D$12,0)","v":0},{"$f":"IF($AP46>0,'INVOER JUDOKA''S'!C46,0)","v":0},{"$f":"IF($AP46>0,'INVOER JUDOKA''S'!D46,0)","v":0},{"$f":"IF($AP46>0,'INVOER JUDOKA''S'!E46,0)","v":0},{"$f":"IF($AP46>0,'INVOER JUDOKA''S'!F46,0)","v":0},"00:00:00",{"$f":"IF($AP46>0,'INVOER JUDOKA''S'!H46,0)","v":0},0,0,0,0,0,0,0,21,0]
[0,0,null,null," ",0,null,null,null,null,null,{"$f":"IF(ISERROR(VLOOKUP(K47,'GEGEVENS-2023'!$AE$4:$AF$113,2,FALSE)),\"\",VLOOKUP(K47,'GEGEVENS-2023'!$AE$4:$AF$113,2,FALSE))","v":""},{"$f":"IF(ISERROR(VLOOKUP($P47,'GEGEVENS-2023'!$AG$3:$AJ$113,4,FALSE)),\"\",VLOOKUP($P47,'GEGEVENS-2023'!$AG$3:$AJ$113,4,FALSE))","v":""},null,{"$f":"IF(ISERROR(VLOOKUP($N47,'GEGEVENS-2023'!$A$17:$B$18,2,FALSE)),\"\",VLOOKUP($N47,'GEGEVENS-2023'!$A$17:$B$18,2,FALSE))","v":""},"-",{"$f":"IF(ISERROR(VLOOKUP($P47,'GEGEVENS-2023'!$AG$3:$AI$113,3,FALSE)),\"\",VLOOKUP($P47,'GEGEVENS-2023'!$AG$3:$AI$113,3,FALSE))","v":""},null,{"$f":"IF(ISERROR(VLOOKUP(R47,'GEWICHT PER INSCHRIJVING'!$A$2:$AE$10,23,FALSE)),\"\",VLOOKUP(R47,'GEWICHT PER INSCHRIJVING'!$A$2:$AE$10,23,FALSE))","v":""},null,null,{"$f":"IF(ISERROR(VLOOKUP($U47,'GEGEVENS-2023'!$C$18:$D$28,2,FALSE)),\"\",VLOOKUP($U47,'GEGEVENS-2023'!$C$18:$D$28,2,FALSE))","v":""},0,null,false,"recreant","recreant","recreant","//",0,{"$f":"IF(ISERROR(VLOOKUP(AC47,'GEGEVENS-2023'!$AX$4:$AY$118,2,FALSE)),\"\",VLOOKUP(AC47,'GEGEVENS-2023'!$AX$4:$AY$118,2,FALSE))","v":""},0,1,0,0,0,0,0,0,0,1,{"$f":"IF($AO47=8,'INSCHRIJVING SPORTSCHOOL'!$D$5,0)","v":0},{"$f":"IF($AP47>0,CONCATENATE('INSCHRIJVING SPORTSCHOOL'!$D$6,\";\",'INSCHRIJVING SPORTSCHOOL'!$D$7,\";\",'INSCHRIJVING SPORTSCHOOL'!$D$8),0)","v":0},{"$f":"IF($AP47>0,'INSCHRIJVING SPORTSCHOOL'!$D$9,0)","v":0},{"$f":"IF($AP47>0,'INSCHRIJVING SPORTSCHOOL'!$D$10,0)","v":0},{"$f":"IF($AP47>0,'INSCHRIJVING SPORTSCHOOL'!$D$11,0)","v":0},{"$f":"IF($AP47>0,'INSCHRIJVING SPORTSCHOOL'!$D$12,0)","v":0},{"$f":"IF($AP47>0,'INVOER JUDOKA''S'!C47,0)","v":0},{"$f":"IF($AP47>0,'INVOER JUDOKA''S'!D47,0)","v":0},{"$f":"IF($AP47>0,'INVOER JUDOKA''S'!E47,0)","v":0},{"$f":"IF($AP47>0,'INVOER JUDOKA''S'!F47,0)","v":0},"00:00:00",{"$f":"IF($AP47>0,'INVOER JUDOKA''S'!H47,0)","v":0},0,0,0,0,0,0,0,22,0]
[0,0,null,null," ",0,null,null,null,null,null,{"$f":"IF(ISERROR(VLOOKUP(K48,'GEGEVENS-2023'!$AE$4:$AF$113,2,FALSE)),\"\",VLOOKUP(K48,'GEGEVENS-2023'!$AE$4:$AF$113,2,FALSE))","v":""},{"$f":"IF(ISERROR(VLOOKUP($P48,'GEGEVENS-2023'!$AG$3:$AJ$113,4,FALSE)),\"\",VLOOKUP($P48,'GEGEVENS-2023'!$AG$3:$AJ$113,4,FALSE))","v":""},null,{"$f":"IF(ISERROR(VLOOKUP($N48,'GEGEVENS-2023'!$A$17:$B$18,2,FALSE)),\"\",VLOOKUP($N48,'GEGEVENS-2023'!$A$17:$B$18,2,FALSE))","v":""},"-",{"$f":"IF(ISERROR(VLOOKUP($P48,'GEGEVENS-2023'!$AG$3:$AI$113,3,FALSE)),\"\",VLOOKUP($P48,'GEGEVENS-2023'!$AG$3:$AI$113,3,FALSE))","v":""},null,{"$f":"IF(ISERROR(VLOOKUP(R48,'GEWICHT PER INSCHRIJVING'!$A$2:$AE$10,24,FALSE)),\"\",VLOOKUP(R48,'GEWICHT PER INSCHRIJVING'!$A$2:$AE$10,24,FALSE))","v":""},null,null,{"$f":"IF(ISERROR(VLOOKUP($U48,'GEGEVENS-2023'!$C$18:$D$28,2,FALSE)),\"\",VLOOKUP($U48,'GEGEVENS-2023'!$C$18:$D$28,2,FALSE))","v":""},0,null,false,"recreant","recreant","recreant","//",0,{"$f":"IF(ISERROR(VLOOKUP(AC48,'GEGEVENS-2023'!$AX$4:$AY$118,2,FALSE)),\"\",VLOOKUP(AC48,'GEGEVENS-2023'!$AX$4:$AY$118,2,FALSE))","v":""},0,1,0,0,0,0,0,0,0,1,{"$f":"IF($AO48=8,'INSCHRIJVING SPORTSCHOOL'!$D$5,0)","v":0},{"$f":"IF($AP48>0,CONCATENATE('INSCHRIJVING SPORTSCHOOL'!$D$6,\";\",'INSCHRIJVING SPORTSCHOOL'!$D$7,\";\",'INSCHRIJVING SPORTSCHOOL'!$D$8),0)","v":0},{"$f":"IF($AP48>0,'INSCHRIJVING SPORTSCHOOL'!$D$9,0)","v":0},{"$f":"IF($AP48>0,'INSCHRIJVING SPORTSCHOOL'!$D$10,0)","v":0},{"$f":"IF($AP48>0,'INSCHRIJVING SPORTSCHOOL'!$D$11,0)","v":0},{"$f":"IF($AP48>0,'INSCHRIJVING SPORTSCHOOL'!$D$12,0)","v":0},{"$f":"IF($AP48>0,'INVOER JUDOKA''S'!C48,0)","v":0},{"$f":"IF($AP48>0,'INVOER JUDOKA''S'!D48,0)","v":0},{"$f":"IF($AP48>0,'INVOER JUDOKA''S'!E48,0)","v":0},{"$f":"IF($AP48>0,'INVOER JUDOKA''S'!F48,0)","v":0},"00:00:00",{"$f":"IF($AP48>0,'INVOER JUDOKA''S'!H48,0)","v":0},0,0,0,0,0,0,0,23,0]
[0,0,null,null," ",0,null,null,null,null,null,{"$f":"IF(ISERROR(VLOOKUP(K49,'GEGEVENS-2023'!$AE$4:$AF$113,2,FALSE)),\"\",VLOOKUP(K49,'GEGEVENS-2023'!$AE$4:$AF$113,2,FALSE))","v":""},{"$f":"IF(ISERROR(VLOOKUP($P49,'GEGEVENS-2023'!$AG$3:$AJ$113,4,FALSE)),\"\",VLOOKUP($P49,'GEGEVENS-2023'!$AG$3:$AJ$113,4,FALSE))","v":""},null,{"$f":"IF(ISERROR(VLOOKUP($N49,'GEGEVENS-2023'!$A$17:$B$18,2,FALSE)),\"\",VLOOKUP($N49,'GEGEVENS-2023'!$A$17:$B$18,2,FALSE))","v":""},"-",{"$f":"IF(ISERROR(VLOOKUP($P49,'GEGEVENS-2023'!$AG$3:$AI$113,3,FALSE)),\"\",VLOOKUP($P49,'GEGEVENS-2023'!$AG$3:$AI$113,3,FALSE))","v":""},null,{"$f":"IF(ISERROR(VLOOKUP(R49,'GEWICHT PER INSCHRIJVING'!$A$2:$AE$10,25,FALSE)),\"\",VLOOKUP(R49,'GEWICHT PER INSCHRIJVING'!$A$2:$AE$10,25,FALSE))","v":""},null,null,{"$f":"IF(ISERROR(VLOOKUP($U49,'GEGEVENS-2023'!$C$18:$D$28,2,FALSE)),\"\",VLOOKUP($U49,'GEGEVENS-2023'!$C$18:$D$28,2,FALSE))","v":""},0,null,false,"recreant","recreant","recreant","//",0,{"$f":"IF(ISERROR(VLOOKUP(AC49,'GEGEVENS-2023'!$AX$4:$AY$118,2,FALSE)),\"\",VLOOKUP(AC49,'GEGEVENS-2023'!$AX$4:$AY$118,2,FALSE))","v":""},0,1,0,0,0,0,0,0,0,1,{"$f":"IF($AO49=8,'INSCHRIJVING SPORTSCHOOL'!$D$5,0)","v":0},{"$f":"IF($AP49>0,CONCATENATE('INSCHRIJVING SPORTSCHOOL'!$D$6,\";\",'INSCHRIJVING SPORTSCHOOL'!$D$7,\";\",'INSCHRIJVING SPORTSCHOOL'!$D$8),0)","v":0},{"$f":"IF($AP49>0,'INSCHRIJVING SPORTSCHOOL'!$D$9,0)","v":0},{"$f":"IF($AP49>0,'INSCHRIJVING SPORTSCHOOL'!$D$10,0)","v":0},{"$f":"IF($AP49>0,'INSCHRIJVING SPORTSCHOOL'!$D$11,0)","v":0},{"$f":"IF($AP49>0,'INSCHRIJVING SPORTSCHOOL'!$D$12,0)","v":0},{"$f":"IF($AP49>0,'INVOER JUDOKA''S'!C49,0)","v":0},{"$f":"IF($AP49>0,'INVOER JUDOKA''S'!D49,0)","v":0},{"$f":"IF($AP49>0,'INVOER JUDOKA''S'!E49,0)","v":0},{"$f":"IF($AP49>0,'INVOER JUDOKA''S'!F49,0)","v":0},"00:00:00",{"$f":"IF($AP49>0,'INVOER JUDOKA''S'!H49,0)","v":0},0,0,0,0,0,0,0,24,0]
[0,0,null,null," ",0,null,null,null,null,null,{"$f":"IF(ISERROR(VLOOKUP(K50,'GEGEVENS-2023'!$AE$4:$AF$113,2,FALSE)),\"\",VLOOKUP(K50,'GEGEVENS-2023'!$AE$4:$AF$113,2,FALSE))","v":""},{"$f":"IF(ISERROR(VLOOKUP($P50,'GEGEVENS-2023'!$AG$3:$AJ$113,4,FALSE)),\"\",VLOOKUP($P50,'GEGEVENS-2023'!$AG$3:$AJ$113,4,FALSE))","v":""},null,{"$f":"IF(ISERROR(VLOOKUP($N50,'GEGEVENS-2023'!$A$17:$B$18,2,FALSE)),\"\",VLOOKUP($N50,'GEGEVENS-2023'!$A$17:$B$18,2,FALSE))","v":""},"-",{"$f":"IF(ISERROR(VLOOKUP($P50,'GEGEVENS-2023'!$AG$3:$AI$113,3,FALSE)),\"\",VLOOKUP($P50,'GEGEVENS-2023'!$AG$3:$AI$113,3,FALSE))","v":""},null,{"$f":"IF(ISERROR(VLOOKUP(R50,'GEWICHT PER INSCHRIJVING'!$A$2:$AE$10,26,FALSE)),\"\",VLOOKUP(R50,'GEWICHT PER INSCHRIJVING'!$A$2:$AE$10,26,FALSE))","v":""},null,null,{"$f":"IF(ISERROR(VLOOKUP($U50,'GEGEVENS-2023'!$C$18:$D$28,2,FALSE)),\"\",VLOOKUP($U50,'GEGEVENS-2023'!$C$18:$D$28,2,FALSE))","v":""},0,null,false,"recreant","recreant","recreant","//",0,{"$f":"IF(ISERROR(VLOOKUP(AC50,'GEGEVENS-2023'!$AX$4:$AY$118,2,FALSE)),\"\",VLOOKUP(AC50,'GEGEVENS-2023'!$AX$4:$AY$118,2,FALSE))","v":""},0,1,0,0,0,0,0,0,0,1,{"$f":"IF($AO50=8,'INSCHRIJVING SPORTSCHOOL'!$D$5,0)","v":0},{"$f":"IF($AP50>0,CONCATENATE('INSCHRIJVING SPORTSCHOOL'!$D$6,\";\",'INSCHRIJVING SPORTSCHOOL'!$D$7,\";\",'INSCHRIJVING SPORTSCHOOL'!$D$8),0)","v":0},{"$f":"IF($AP50>0,'INSCHRIJVING SPORTSCHOOL'!$D$9,0)","v":0},{"$f":"IF($AP50>0,'INSCHRIJVING SPORTSCHOOL'!$D$10,0)","v":0},{"$f":"IF($AP50>0,'INSCHRIJVING SPORTSCHOOL'!$D$11,0)","v":0},{"$f":"IF($AP50>0,'INSCHRIJVING SPORTSCHOOL'!$D$12,0)","v":0},{"$f":"IF($AP50>0,'INVOER JUDOKA''S'!C50,0)","v":0},{"$f":"IF($AP50>0,'INVOER JUDOKA''S'!D50,0)","v":0},{"$f":"IF($AP50>0,'INVOER JUDOKA''S'!E50,0)","v":0},{"$f":"IF($AP50>0,'INVOER JUDOKA''S'!F50,0)","v":0},"00:00:00",{"$f":"IF($AP50>0,'INVOER JUDOKA''S'!H50,0)","v":0},0,0,0,0,0,0,0,25,0]
[0,0,null,null," ",0,null,null,null,null,null,{"$f":"IF(ISERROR(VLOOKUP(K51,'GEGEVENS-2023'!$AE$4:$AF$113,2,FALSE)),\"\",VLOOKUP(K51,'GEGEVENS-2023'!$AE$4:$AF$113,2,FALSE))","v":""},{"$f":"IF(ISERROR(VLOOKUP($P51,'GEGEVENS-2023'!$AG$3:$AJ$113,4,FALSE)),\"\",VLOOKUP($P51,'GEGEVENS-2023'!$AG$3:$AJ$113,4,FALSE))","v":""},null,{"$f":"IF(ISERROR(VLOOKUP($N51,'GEGEVENS-2023'!$A$17:$B$18,2,FALSE)),\"\",VLOOKUP($N51,'GEGEVENS-2023'!$A$17:$B$18,2,FALSE))","v":""},"-",{"$f":"IF(ISERROR(VLOOKUP($P51,'GEGEVENS-2023'!$AG$3:$AI$113,3,FALSE)),\"\",VLOOKUP($P51,'GEGEVENS-2023'!$AG$3:$AI$113,3,FALSE))","v":""},null,{"$f":"IF(ISERROR(VLOOKUP(R51,'GEWICHT PER INSCHRIJVING'!$A$2:$AE$10,27,FALSE)),\"\",VLOOKUP(R51,'GEWICHT PER INSCHRIJVING'!$A$2:$AE$10,27,FALSE))","v":""},null,null,{"$f":"IF(ISERROR(VLOOKUP($U51,'GEGEVENS-2023'!$C$18:$D$28,2,FALSE)),\"\",VLOOKUP($U51,'GEGEVENS-2023'!$C$18:$D$28,2,FALSE))","v":""},0,null,false,"recreant","recreant","recreant","//",0,{"$f":"IF(ISERROR(VLOOKUP(AC51,'GEGEVENS-2023'!$AX$4:$AY$118,2,FALSE)),\"\",VLOOKUP(AC51,'GEGEVENS-2023'!$AX$4:$AY$118,2,FALSE))","v":""},0,1,0,0,0,0,0,0,0,1,{"$f":"IF($AO51=8,'INSCHRIJVING SPORTSCHOOL'!$D$5,0)","v":0},{"$f":"IF($AP51>0,CONCATENATE('INSCHRIJVING SPORTSCHOOL'!$D$6,\";\",'INSCHRIJVING SPORTSCHOOL'!$D$7,\";\",'INSCHRIJVING SPORTSCHOOL'!$D$8),0)","v":0},{"$f":"IF($AP51>0,'INSCHRIJVING SPORTSCHOOL'!$D$9,0)","v":0},{"$f":"IF($AP51>0,'INSCHRIJVING SPORTSCHOOL'!$D$10,0)","v":0},{"$f":"IF($AP51>0,'INSCHRIJVING SPORTSCHOOL'!$D$11,0)","v":0},{"$f":"IF($AP51>0,'INSCHRIJVING SPORTSCHOOL'!$D$12,0)","v":0},{"$f":"IF($AP51>0,'INVOER JUDOKA''S'!C51,0)","v":0},{"$f":"IF($AP51>0,'INVOER JUDOKA''S'!D51,0)","v":0},{"$f":"IF($AP51>0,'INVOER JUDOKA''S'!E51,0)","v":0},{"$f":"IF($AP51>0,'INVOER JUDOKA''S'!F51,0)","v":0},"00:00:00",{"$f":"IF($AP51>0,'INVOER JUDOKA''S'!H51,0)","v":0},0,0,0,0,0,0,0,26,0]
[0,0,null,null," ",0,null,null,null,null,null,{"$f":"IF(ISERROR(VLOOKUP(K52,'GEGEVENS-2023'!$AE$4:$AF$113,2,FALSE)),\"\",VLOOKUP(K52,'GEGEVENS-2023'!$AE$4:$AF$113,2,FALSE))","v":""},{"$f":"IF(ISERROR(VLOOKUP($P52,'GEGEVENS-2023'!$AG$3:$AJ$113,4,FALSE)),\"\",VLOOKUP($P52,'GEGEVENS-2023'!$AG$3:$AJ$113,4,FALSE))","v":""},null,{"$f":"IF(ISERROR(VLOOKUP($N52,'GEGEVENS-2023'!$A$17:$B$18,2,FALSE)),\"\",VLOOKUP($N52,'GEGEVENS-2023'!$A$17:$B$18,2,FALSE))","v":""},"-",{"$f":"IF(ISERROR(VLOOKUP($P52,'GEGEVENS-2023'!$AG$3:$AI$113,3,FALSE)),\"\",VLOOKUP($P52,'GEGEVENS-2023'!$AG$3:$AI$113,3,FALSE))","v":""},null,{"$f":"IF(ISERROR(VLOOKUP(R52,'GEWICHT PER INSCHRIJVING'!$A$2:$AE$10,28,FALSE)),\"\",VLOOKUP(R52,'GEWICHT PER INSCHRIJVING'!$A$2:$AE$10,28,FALSE))","v":""},null,null,{"$f":"IF(ISERROR(VLOOKUP($U52,'GEGEVENS-2023'!$C$18:$D$28,2,FALSE)),\"\",VLOOKUP($U52,'GEGEVENS-2023'!$C$18:$D$28,2,FALSE))","v":""},0,null,false,"recreant","recreant","recreant","//",0,{"$f":"IF(ISERROR(VLOOKUP(AC52,'GEGEVENS-2023'!$AX$4:$AY$118,2,FALSE)),\"\",VLOOKUP(AC52,'GEGEVENS-2023'!$AX$4:$AY$118,2,FALSE))","v":""},0,1,0,0,0,0,0,0,0,1,{"$f":"IF($AO52=8,'INSCHRIJVING SPORTSCHOOL'!$D$5,0)","v":0},{"$f":"IF($AP52>0,CONCATENATE('INSCHRIJVING SPORTSCHOOL'!$D$6,\";\",'INSCHRIJVING SPORTSCHOOL'!$D$7,\";\",'INSCHRIJVING SPORTSCHOOL'!$D$8),0)","v":0},{"$f":"IF($AP52>0,'INSCHRIJVING SPORTSCHOOL'!$D$9,0)","v":0},{"$f":"IF($AP52>0,'INSCHRIJVING SPORTSCHOOL'!$D$10,0)","v":0},{"$f":"IF($AP52>0,'INSCHRIJVING SPORTSCHOOL'!$D$11,0)","v":0},{"$f":"IF($AP52>0,'INSCHRIJVING SPORTSCHOOL'!$D$12,0)","v":0},{"$f":"IF($AP52>0,'INVOER JUDOKA''S'!C52,0)","v":0},{"$f":"IF($AP52>0,'INVOER JUDOKA''S'!D52,0)","v":0},{"$f":"IF($AP52>0,'INVOER JUDOKA''S'!E52,0)","v":0},{"$f":"IF($AP52>0,'INVOER JUDOKA''S'!F52,0)","v":0},"00:00:00",{"$f":"IF($AP52>0,'INVOER JUDOKA''S'!H52,0)","v":0},0,0,0,0,0,0,0,27,0]
[0,0,null,null," ",0,null,null,null,null,null,{"$f":"IF(ISERROR(VLOOKUP(K53,'GEGEVENS-2023'!$AE$4:$AF$113,2,FALSE)),\"\",VLOOKUP(K53,'GEGEVENS-2023'!$AE$4:$AF$113,2,FALSE))","v":""},{"$f":"IF(ISERROR(VLOOKUP($P53,'GEGEVENS-2023'!$AG$3:$AJ$113,4,FALSE)),\"\",VLOOKUP($P53,'GEGEVENS-2023'!$AG$3:$AJ$113,4,FALSE))","v":""},null,{"$f":"IF(ISERROR(VLOOKUP($N53,'GEGEVENS-2023'!$A$17:$B$18,2,FALSE)),\"\",VLOOKUP($N53,'GEGEVENS-2023'!$A$17:$B$18,2,FALSE))","v":""},"-",{"$f":"IF(ISERROR(VLOOKUP($P53,'GEGEVENS-2023'!$AG$3:$AI$113,3,FALSE)),\"\",VLOOKUP($P53,'GEGEVENS-2023'!$AG$3:$AI$113,3,FALSE))","v":""},null,{"$f":"IF(ISERROR(VLOOKUP(R53,'GEWICHT PER INSCHRIJVING'!$A$2:$AE$10,29,FALSE)),\"\",VLOOKUP(R53,'GEWICHT PER INSCHRIJVING'!$A$2:$AE$10,29,FALSE))","v":""},null,null,{"$f":"IF(ISERROR(VLOOKUP($U53,'GEGEVENS-2023'!$C$18:$D$28,2,FALSE)),\"\",VLOOKUP($U53,'GEGEVENS-2023'!$C$18:$D$28,2,FALSE))","v":""},0,null,false,"recreant","recreant","recreant","//",0,{"$f":"IF(ISERROR(VLOOKUP(AC53,'GEGEVENS-2023'!$AX$4:$AY$118,2,FALSE)),\"\",VLOOKUP(AC53,'GEGEVENS-2023'!$AX$4:$AY$118,2,FALSE))","v":""},0,1,0,0,0,0,0,0,0,1,{"$f":"IF($AO53=8,'INSCHRIJVING SPORTSCHOOL'!$D$5,0)","v":0},{"$f":"IF($AP53>0,CONCATENATE('INSCHRIJVING SPORTSCHOOL'!$D$6,\";\",'INSCHRIJVING SPORTSCHOOL'!$D$7,\";\",'INSCHRIJVING SPORTSCHOOL'!$D$8),0)","v":0},{"$f":"IF($AP53>0,'INSCHRIJVING SPORTSCHOOL'!$D$9,0)","v":0},{"$f":"IF($AP53>0,'INSCHRIJVING SPORTSCHOOL'!$D$10,0)","v":0},{"$f":"IF($AP53>0,'INSCHRIJVING SPORTSCHOOL'!$D$11,0)","v":0},{"$f":"IF($AP53>0,'INSCHRIJVING SPORTSCHOOL'!$D$12,0)","v":0},{"$f":"IF($AP53>0,'INVOER JUDOKA''S'!C53,0)","v":0},{"$f":"IF($AP53>0,'INVOER JUDOKA''S'!D53,0)","v":0},{"$f":"IF($AP53>0,'INVOER JUDOKA''S'!E53,0)","v":0},{"$f":"IF($AP53>0,'INVOER JUDOKA''S'!F53,0)","v":0},"00:00:00",{"$f":"IF($AP53>0,'INVOER JUDOKA''S'!H53,0)","v":0},0,0,0,0,0,0,0,28,0]
[0,0,null,null," ",0,null,null,null,null,null,{"$f":"IF(ISERROR(VLOOKUP(K54,'GEGEVENS-2023'!$AE$4:$AF$113,2,FALSE)),\"\",VLOOKUP(K54,'GEGEVENS-2023'!$AE$4:$AF$113,2,FALSE))","v":""},{"$f":"IF(ISERROR(VLOOKUP($P54,'GEGEVENS-2023'!$AG$3:$AJ$113,4,FALSE)),\"\",VLOOKUP($P54,'GEGEVENS-2023'!$AG$3:$AJ$113,4,FALSE))","v":""},null,{"$f":"IF(ISERROR(VLOOKUP($N54,'GEGEVENS-2023'!$A$17:$B$18,2,FALSE)),\"\",VLOOKUP($N54,'GEGEVENS-2023'!$A$17:$B$18,2,FALSE))","v":""},"-",{"$f":"IF(ISERROR(VLOOKUP($P54,'GEGEVENS-2023'!$AG$3:$AI$113,3,FALSE)),\"\",VLOOKUP($P54,'GEGEVENS-2023'!$AG$3:$AI$113,3,FALSE))","v":""},null,{"$f":"IF(ISERROR(VLOOKUP(R54,'GEWICHT PER INSCHRIJVING'!$A$2:$AE$10,30,FALSE)),\"\",VLOOKUP(R54,'GEWICHT PER INSCHRIJVING'!$A$2:$AE$10,30,FALSE))","v":""},null,null,{"$f":"IF(ISERROR(VLOOKUP($U54,'GEGEVENS-2023'!$C$18:$D$28,2,FALSE)),\"\",VLOOKUP($U54,'GEGEVENS-2023'!$C$18:$D$28,2,FALSE))","v":""},0,null,false,"recreant","recreant","recreant","//",0,{"$f":"IF(ISERROR(VLOOKUP(AC54,'GEGEVENS-2023'!$AX$4:$AY$118,2,FALSE)),\"\",VLOOKUP(AC54,'GEGEVENS-2023'!$AX$4:$AY$118,2,FALSE))","v":""},0,1,0,0,0,0,0,0,0,1,{"$f":"IF($AO54=8,'INSCHRIJVING SPORTSCHOOL'!$D$5,0)","v":0},{"$f":"IF($AP54>0,CONCATENATE('INSCHRIJVING SPORTSCHOOL'!$D$6,\";\",'INSCHRIJVING SPORTSCHOOL'!$D$7,\";\",'INSCHRIJVING SPORTSCHOOL'!$D$8),0)","v":0},{"$f":"IF($AP54>0,'INSCHRIJVING SPORTSCHOOL'!$D$9,0)","v":0},{"$f":"IF($AP54>0,'INSCHRIJVING SPORTSCHOOL'!$D$10,0)","v":0},{"$f":"IF($AP54>0,'INSCHRIJVING SPORTSCHOOL'!$D$11,0)","v":0},{"$f":"IF($AP54>0,'INSCHRIJVING SPORTSCHOOL'!$D$12,0)","v":0},{"$f":"IF($AP54>0,'INVOER JUDOKA''S'!C54,0)","v":0},{"$f":"IF($AP54>0,'INVOER JUDOKA''S'!D54,0)","v":0},{"$f":"IF($AP54>0,'INVOER JUDOKA''S'!E54,0)","v":0},{"$f":"IF($AP54>0,'INVOER JUDOKA''S'!F54,0)","v":0},"00:00:00",{"$f":"IF($AP54>0,'INVOER JUDOKA''S'!H54,0)","v":0},0,0,0,0,0,0,0,29,0]
[0,0,null,null," ",0,null,null,null,null,null,{"$f":"IF(ISERROR(VLOOKUP(K55,'GEGEVENS-2023'!$AE$4:$AF$113,2,FALSE)),\"\",VLOOKUP(K55,'GEGEVENS-2023'!$AE$4:$AF$113,2,FALSE))","v":""},{"$f":"IF(ISERROR(VLOOKUP($P55,'GEGEVENS-2023'!$AG$3:$AJ$113,4,FALSE)),\"\",VLOOKUP($P55,'GEGEVENS-2023'!$AG$3:$AJ$113,4,FALSE))","v":""},null,{"$f":"IF(ISERROR(VLOOKUP($N55,'GEGEVENS-2023'!$A$17:$B$18,2,FALSE)),\"\",VLOOKUP($N55,'GEGEVENS-2023'!$A$17:$B$18,2,FALSE))","v":""},"-",{"$f":"IF(ISERROR(VLOOKUP($P55,'GEGEVENS-2023'!$AG$3:$AI$113,3,FALSE)),\"\",VLOOKUP($P55,'GEGEVENS-2023'!$AG$3:$AI$113,3,FALSE))","v":""},null,{"$f":"IF(ISERROR(VLOOKUP(R55,'GEWICHT PER INSCHRIJVING'!$A$2:$AE$10,31,FALSE)),\"\",VLOOKUP(R55,'GEWICHT PER INSCHRIJVING'!$A$2:$AE$10,31,FALSE))","v":""},null,null,{"$f":"IF(ISERROR(VLOOKUP($U55,'GEGEVENS-2023'!$C$18:$D$28,2,FALSE)),\"\",VLOOKUP($U55,'GEGEVENS-2023'!$C$18:$D$28,2,FALSE))","v":""},0,null,false,"recreant","recreant","recreant","//",0,{"$f":"IF(ISERROR(VLOOKUP(AC55,'GEGEVENS-2023'!$AX$4:$AY$118,2,FALSE)),\"\",VLOOKUP(AC55,'GEGEVENS-2023'!$AX$4:$AY$118,2,FALSE))","v":""},0,1,0,0,0,0,0,0,0,1,{"$f":"IF($AO55=8,'INSCHRIJVING SPORTSCHOOL'!$D$5,0)","v":0},{"$f":"IF($AP55>0,CONCATENATE('INSCHRIJVING SPORTSCHOOL'!$D$6,\";\",'INSCHRIJVING SPORTSCHOOL'!$D$7,\";\",'INSCHRIJVING SPORTSCHOOL'!$D$8),0)","v":0},{"$f":"IF($AP55>0,'INSCHRIJVING SPORTSCHOOL'!$D$9,0)","v":0},{"$f":"IF($AP55>0,'INSCHRIJVING SPORTSCHOOL'!$D$10,0)","v":0},{"$f":"IF($AP55>0,'INSCHRIJVING SPORTSCHOOL'!$D$11,0)","v":0},{"$f":"IF($AP55>0,'INSCHRIJVING SPORTSCHOOL'!$D$12,0)","v":0},{"$f":"IF($AP55>0,'INVOER JUDOKA''S'!C55,0)","v":0},{"$f":"IF($AP55>0,'INVOER JUDOKA''S'!D55,0)","v":0},{"$f":"IF($AP55>0,'INVOER JUDOKA''S'!E55,0)","v":0},{"$f":"IF($AP55>0,'INVOER JUDOKA''S'!F55,0)","v":0},"00:00:00",{"$f":"IF($AP55>0,'INVOER JUDOKA''S'!H55,0)","v":0},0,0,0,0,0,0,0,30,0]
[null,null,null,null,null,null,null,null,null,null,null,null,null,null,null,null,{"$f":"IF(ISERROR(VLOOKUP($P56,'GEGEVENS-2023'!$AG$3:$AI$112,3,FALSE)),\"\",VLOOKUP($P56,'GEGEVENS-2023'!$AG$3:$AI$112,3,FALSE))","v":""},null,null,null,null,null,null,null,null,null,null,null,null,null,null,null,0,0,0,0,0,0,0,0,{"$f":"SUM(AG56:AN56)","v":0},{"$f":"IF($AO56=8,'INSCHRIJVING SPORTSCHOOL'!$D$5,0)","v":0},null,null,null,null,null,null,null,null,null,null,null,null,null,{"$f":"IF(AQ56>0,S56,0)","v":0}]
[{"$f":"IF(F57+U57>1,BI57,0)","v":0},null,null,null,null,null,null,null,null,null,null,null,null,null,null,null,{"$f":"IF(ISERROR(VLOOKUP($P57,'GEGEVENS-2023'!$AG$3:$AI$112,3,FALSE)),\"\",VLOOKUP($P57,'GEGEVENS-2023'!$AG$3:$AI$112,3,FALSE))","v":""},null,null,null,null,null,null,null,null,null,null,null,null,null,null,null,0,0,0,0,0,0,0,0,0,{"$f":"IF($AO57=8,'INSCHRIJVING SPORTSCHOOL'!$D$5,0)","v":0},null,null,null,null,null,null,null,null,null,null,null,null,null,0]
[0,null,null,null,null,null,null,null,null,null,null,null,null,null,null,null,{"$f":"IF(ISERROR(VLOOKUP($P58,'GEGEVENS-2023'!$AG$3:$AI$112,3,FALSE)),\"\",VLOOKUP($P58,'GEGEVENS-2023'!$AG$3:$AI$112,3,FALSE))","v":""},null,null,null,null,null,null,null,null,null,null,null,null,null,null,null,0,0,0,0,0,0,0,0,0,{"$f":"IF($AO58=8,'INSCHRIJVING SPORTSCHOOL'!$D$5,0)","v":0},null,null,null,null,null,null,null,null,null,null,null,null,null,0]
[0,null,null,null,null,null,null,null,null,null,null,null,null,null,null,null,{"$f":"IF(ISERROR(VLOOKUP($P59,'GEGEVENS-2023'!$AG$3:$AI$112,3,FALSE)),\"\",VLOOKUP($P59,'GEGEVENS-2023'!$AG$3:$AI$112,3,FALSE))","v":""},null,null,null,null,null,null,null,null,null,null,null,null,null,null,null,0,0,0,0,0,0,0,0,0,{"$f":"IF($AO59=8,'INSCHRIJVING SPORTSCHOOL'!$D$5,0)","v":0},null,null,null,null,null,null,null,null,null,null,null,null,null,0]
[0,null,null,null,null,null,null,null,null,null,null,null,null,null,null,null,{"$f":"IF(ISERROR(VLOOKUP($P60,'GEGEVENS-2023'!$AG$3:$AI$112,3,FALSE)),\"\",VLOOKUP($P60,'GEGEVENS-2023'!$AG$3:$AI$112,3,FALSE))","v":""},null,null,null,null,null,null,null,null,null,null,null,null,null,null,null,0,0,0,0,0,0,0,0,0,{"$f":"IF($AO60=8,'INSCHRIJVING SPORTSCHOOL'!$D$5,0)","v":0},null,null,null,null,null,null,null,null,null,null,null,null,null,0]
[0,null,null,null,null,null,null,null,null,null,null,null,null,null,null,null,{"$f":"IF(ISERROR(VLOOKUP($P61,'GEGEVENS-2023'!$AG$3:$AI$112,3,FALSE)),\"\",VLOOKUP($P61,'GEGEVENS-2023'!$AG$3:$AI$112,3,FALSE))","v":""},null,null,null,null,null,null,null,null,null,null,null,null,null,null,null,0,0,0,0,0,0,0,0,0,{"$f":"IF($AO61=8,'INSCHRIJVING SPORTSCHOOL'!$D$5,0)","v":0},null,null,null,null,null,null,null,null,null,null,null,null,null,0]
[0,null,null,null,null,null,null,null,null,null,null,null,null,null,null,null,{"$f":"IF(ISERROR(VLOOKUP($P62,'GEGEVENS-2023'!$AG$3:$AI$112,3,FALSE)),\"\",VLOOKUP($P62,'GEGEVENS-2023'!$AG$3:$AI$112,3,FALSE))","v":""},null,null,null,null,null,null,null,null,null,null,null,null,null,null,null,0,0,0,0,0,0,0,0,0,{"$f":"IF($AO62=8,'INSCHRIJVING SPORTSCHOOL'!$D$5,0)","v":0},null,null,null,null,null,null,null,null,null,null,null,null,null,0]
[0,null,null,null,null,null,null,null,null,null,null,null,null,null,null,null,{"$f":"IF(ISERROR(VLOOKUP($P63,'GEGEVENS-2023'!$AG$3:$AI$112,3,FALSE)),\"\",VLOOKUP($P63,'GEGEVENS-2023'!$AG$3:$AI$112,3,FALSE))","v":""},null,null,null,null,null,null,null,null,null,null,null,null,null,null,null,0,0,0,0,0,0,0,0,0,{"$f":"IF($AO63=8,'INSCHRIJVING SPORTSCHOOL'!$D$5,0)","v":0},null,null,null,null,null,null,null,null,null,null,null,null,null,0]
[0,null,null,null,null,null,null,null,null,null,null,null,null,null,null,null,{"$f":"IF(ISERROR(VLOOKUP($P64,'GEGEVENS-2023'!$AG$3:$AI$112,3,FALSE)),\"\",VLOOKUP($P64,'GEGEVENS-2023'!$AG$3:$AI$112,3,FALSE))","v":""},null,null,null,null,null,null,null,null,null,null,null,null,null,null,null,0,0,0,0,0,0,0,0,0,{"$f":"IF($AO64=8,'INSCHRIJVING SPORTSCHOOL'!$D$5,0)","v":0},null,null,null,null,null,null,null,null,null,null,null,null,null,0]
[0,null,null,null,null,null,null,null,null,null,null,null,null,null,null,null,{"$f":"IF(ISERROR(VLOOKUP($P65,'GEGEVENS-2023'!$AG$3:$AI$112,3,FALSE)),\"\",VLOOKUP($P65,'GEGEVENS-2023'!$AG$3:$AI$112,3,FALSE))","v":""},null,null,null,null,null,null,null,null,null,null,null,null,null,null,null,0,0,0,0,0,0,0,0,0,{"$f":"IF($AO65=8,'INSCHRIJVING SPORTSCHOOL'!$D$5,0)","v":0},null,null,null,null,null,null,null,null,null,null,null,null,null,0]
[0,null,null,null,null,null,null,null,null,null,null,null,null,null,null,null,{"$f":"IF(ISERROR(VLOOKUP($P66,'GEGEVENS-2023'!$AG$3:$AI$112,3,FALSE)),\"\",VLOOKUP($P66,'GEGEVENS-2023'!$AG$3:$AI$112,3,FALSE))","v":""},null,null,null,null,null,null,null,null,null,null,null,null,null,null,null,0,0,0,0,0,0,0,0,0,{"$f":"IF($AO66=8,'INSCHRIJVING SPORTSCHOOL'!$D$5,0)","v":0},null,null,null,null,null,null,null,null,null,null,null,null,null,0]
[]
[]
[]
[]
[]
[]
[]
[]
[]
[]
[]
[]
[]
[]
[]
[]
[]
[]
[]
[]
[]
[]
[]
[]
[]
[]
[]
[]
[]
[]
[]
[]
[]
[]
[]
[]
[]
[]
[]
[]
[]
[]
[]
[]
[]
[]
[]
[]
[]
[]
[]
[]
[]
[]
[]
[]
[]
[]
[]
[]
[]
[]
[]
[]
[]
[]
[]
[]
[]
[]
[]
[]
[]
[]
[]
[]
[]
[]
[]
[]
[]
[]
[]
[]
[]
[]
[]
[]
[]
[]
[]
[]
[]
[]
[]
[]
[]
[]
[]
[]
[]
[]
[]
[]
[]
[]
[]
[]
[]
[]
[]
[]
[]
[]
[]
[]
[]
[]
[]
[]
[]
[]
[]
[]
[]
[]
[]
[]
[]
[]
[]
[]
[]
[]
[]
[]
[]
[]
[]
[]
[]
[]
[]
[]
[]
[]
[]
[]
[]
[]
[]
[]
[]
[]
[]
[]
[]
[]
[]
[]
[]
[]
[]
[]
[]
[]
[]
[]
[]
[]
[]
[]
[]
[]
[]
[]
[]
[]
[]
[]
[]
[]
[]
[]
[]
[]
[]
[]
[]
[]
[]
[]
[]
[]
[]
[]
[]
[]
[]
[]
[]
[]
[]
[]
[]
[]
[]
[]
[]
[]
[]
[]
[]
[]
[]
[]
[]
[]
[]
[]
[]
[]
[]
[]
[]
[]
[]
[]
[]
[]
[]
[]
[]
[]
[]
[]
[]
[]
[]
[]
[]
[]
[]
[]
[]
[]
[]
[]
[]
[]
[]
[]
[]
[]
[]
[]
[]
[]
[]
[]
[]
[]
[]
[]
[]
[]
[]
[]
[]
[]
[]
[]
[]
[]
[]
[]
[]
[]
[]
[]
[]
[]
[]
[]
[]
[]
[]
[]
[]
[]
[]
[]
[]
[]
[]
[]
[]
[]
[]
[]
[]
[]
[]
[]
[]
[]
[]
[]
[]
[]
[]
[]
[]
[]
[]
[]
[]
[]
[]
[]
[]
[]
[]
[]
[]
[]
[]
[]
[]
[]
[]
[]
[]
[]
[]
[]
[]
[]
[]
[]
[]
[]
[]
[]
[]
[]
[]
[]
[]
[]
[]
[]
[]
[]
[]
[]
[]
[]
[]
[]
[]
[]
[]
[]
[]
[]
[]
[]
[]
[]
[]
[]
[]
[]
[]
[]
[]
[]
[]
[]
[]
[]
[]
[]
[]
[]
[]
[]
[]
[]
[]
[]
[]
[]
[]
[]
[]
[]
[]
[]
[]
[]
[]
[]
[]
[]
[]
[]
[]
[]
[]
[]
[]
[]
[]
[]
[]
[]
[]
[]
[]
[]
[]
[]
[]
[]
[]
[]
[]
[]
[]
[]
[]
[]
[]
[]
[]
[]
[]
[]
[]
[]
[]
[]
[]
[]
[]
[]
[]
[]
[]
[]
[]
[]
[]
[]
[]
[]
[]
[]
[]
[]
[]
[]
[]
[]
[]
[]
[]
[]
[]
[]
[]
[]
[]
[]
[]
[]
[]
[]
[]
[]
[]
[]
[]
[]
[null,null,null,null,null,null,null,null,null,null,1]

{"sheet":"PRINT INSCHRIJFLIJST","index":3,"n_rows":36,"n_cols":24,"rows_kept":36,"cut":false,"hidden":false,"merged":[[0,9,0,19],[0,22,0,24],[30,20,30,22],[3,9,3,14]]}
[null,null,null,null,null,null,null,null,null,"INSCHRIJVING TOPJUDO TOERNOOI ALMERE (26-11-2023) "]
[]
[]
[null,null,null,null,null,null,null,null,null,{"$f":"CONCATENATE(\"Sportschool\",\":\",'INSCHRIJVING SPORTSCHOOL'!$D$5)","v":"Sportschool:"},null,null,null,null,null,{"$f":"CONCATENATE(\"AANTAL\",,\" :\",\" \",'INVOER JUDOKA''S'!$BJ$25)","v":"AANTAL : 0"}]
[]
[null,"Sportschool","ADRES;POSTCODE;PLAATS","Contactpersoon","Email","JBN.NR.","Telefoon","VOORNAAM","ACHTERNAAM","JUDOKA","aantal deelnemers","X-NR.","JBN NR.","GEB.DATUM","GESLACHT","GEWICHTSKLASSE","GRADUATIE","ERVARINGSKLASSE","CATEGORIE","POULE",null,null,null,"Lijst printen"]
[null,{"$f":"IF('INVOER JUDOKA''S'!AP26>0,'INVOER JUDOKA''S'!AP26,0)","v":0},{"$f":"IF('INVOER JUDOKA''S'!AQ26>0,'INVOER JUDOKA''S'!AQ26,0)","v":0},{"$f":"IF('INVOER JUDOKA''S'!AR26>0,'INVOER JUDOKA''S'!AR26,0)","v":0},{"$f":"IF('INVOER JUDOKA''S'!AS26>0,'INVOER JUDOKA''S'!AS26,0)","v":0},{"$f":"IF('INVOER JUDOKA''S'!AT26>0,'INVOER JUDOKA''S'!AT26,0)","v":0},{"$f":"IF('INVOER JUDOKA''S'!AU26>0,'INVOER JUDOKA''S'!AU26,0)","v":0},{"$f":"IF('INVOER JUDOKA''S'!AV26>0,'INVOER JUDOKA''S'!AV26,0)","v":0},{"$f":"IF('INVOER JUDOKA''S'!AW26>0,'INVOER JUDOKA''S'!AW26,0)","v":0},{"$f":"IF('INVOER JUDOKA''S'!AX26>0,'INVOER JUDOKA''S'!AX26,0)","v":0},{"$f":"IF('INVOER JUDOKA''S'!AY26>0,'INVOER JUDOKA''S'!AY26,0)","v":0},{"$f":"IF('INVOER JUDOKA''S'!AZ26>0,'INVOER JUDOKA''S'!AZ26,0)","v":"00:00:00"},{"$f":"IF('INVOER JUDOKA''S'!BA26>0,'INVOER JUDOKA''S'!BA26,0)","v":0},{"$f":"IF('INVOER JUDOKA''S'!BB26>0,'INVOER JUDOKA''S'!BB26,0)","v":0},{"$f":"IF('INVOER JUDOKA''S'!BC26>0,'INVOER JUDOKA''S'!BC26,0)","v":0},{"$f":"IF('INVOER JUDOKA''S'!BD26>0,'INVOER JUDOKA''S'!BD26,0)","v":0},{"$f":"IF('INVOER JUDOKA''S'!BE26>0,'INVOER JUDOKA''S'!BE26,0)","v":0},{"$f":"IF('INVOER JUDOKA''S'!BF26>0,'INVOER JUDOKA''S'!BF26,0)","v":0},{"$f":"IF('INVOER JUDOKA''S'!BG26>0,'INVOER JUDOKA''S'!BG26,0)","v":0},{"$f":"IF('INVOER JUDOKA''S'!BH26>0,'INVOER JUDOKA''S'!BH26,0)","v":0}]
[null,{"$f":"IF('INVOER JUDOKA''S'!AP27>0,'INVOER JUDOKA''S'!AP27,0)","v":0},{"$f":"IF('INVOER JUDOKA''S'!AQ27>0,'INVOER JUDOKA''S'!AQ27,0)","v":0},{"$f":"IF('INVOER JUDOKA''S'!AR27>0,'INVOER JUDOKA''S'!AR27,0)","v":0},{"$f":"IF('INVOER JUDOKA''S'!AS27>0,'INVOER JUDOKA''S'!AS27,0)","v":0},{"$f":"IF('INVOER JUDOKA''S'!AT27>0,'INVOER JUDOKA''S'!AT27,0)","v":0},{"$f":"IF('INVOER JUDOKA''S'!AU27>0,'INVOER JUDOKA''S'!AU27,0)","v":0},{"$f":"IF('INVOER JUDOKA''S'!AV27>0,'INVOER JUDOKA''S'!AV27,0)","v":0},{"$f":"IF('INVOER JUDOKA''S'!AW27>0,'INVOER JUDOKA''S'!AW27,0)","v":0},{"$f":"IF('INVOER JUDOKA''S'!AX27>0,'INVOER JUDOKA''S'!AX27,0)","v":0},{"$f":"IF('INVOER JUDOKA''S'!AY27>0,'INVOER JUDOKA''S'!AY27,0)","v":0},{"$f":"IF('INVOER JUDOKA''S'!AZ27>0,'INVOER JUDOKA''S'!AZ27,0)","v":0},{"$f":"IF('INVOER JUDOKA''S'!BA27>0,'INVOER JUDOKA''S'!BA27,0)","v":0},{"$f":"IF('INVOER JUDOKA''S'!BB27>0,'INVOER JUDOKA''S'!BB27,0)","v":0},{"$f":"IF('INVOER JUDOKA''S'!BC27>0,'INVOER JUDOKA''S'!BC27,0)","v":0},{"$f":"IF('INVOER JUDOKA''S'!BD27>0,'INVOER JUDOKA''S'!BD27,0)","v":0},{"$f":"IF('INVOER JUDOKA''S'!BE27>0,'INVOER JUDOKA''S'!BE27,0)","v":0},{"$f":"IF('INVOER JUDOKA''S'!BF27>0,'INVOER JUDOKA''S'!BF27,0)","v":0},{"$f":"IF('INVOER JUDOKA''S'!BG27>0,'INVOER JUDOKA''S'!BG27,0)","v":0},{"$f":"IF('INVOER JUDOKA''S'!BH27>0,'INVOER JUDOKA''S'!BH27,0)","v":0}]
[null,{"$f":"IF('INVOER JUDOKA''S'!AP28>0,'INVOER JUDOKA''S'!AP28,0)","v":0},{"$f":"IF('INVOER JUDOKA''S'!AQ28>0,'INVOER JUDOKA''S'!AQ28,0)","v":0},{"$f":"IF('INVOER JUDOKA''S'!AR28>0,'INVOER JUDOKA''S'!AR28,0)","v":0},{"$f":"IF('INVOER JUDOKA''S'!AS28>0,'INVOER JUDOKA''S'!AS28,0)","v":0},{"$f":"IF('INVOER JUDOKA''S'!AT28>0,'INVOER JUDOKA''S'!AT28,0)","v":0},{"$f":"IF('INVOER JUDOKA''S'!AU28>0,'INVOER JUDOKA''S'!AU28,0)","v":0},{"$f":"IF('INVOER JUDOKA''S'!AV28>0,'INVOER JUDOKA''S'!AV28,0)","v":0},{"$f":"IF('INVOER JUDOKA''S'!AW28>0,'INVOER JUDOKA''S'!AW28,0)","v":0},{"$f":"IF('INVOER JUDOKA''S'!AX28>0,'INVOER JUDOKA''S'!AX28,0)","v":0},{"$f":"IF('INVOER JUDOKA''S'!AY28>0,'INVOER JUDOKA''S'!AY28,0)","v":0},{"$f":"IF('INVOER JUDOKA''S'!AZ28>0,'INVOER JUDOKA''S'!AZ28,0)","v":0},{"$f":"IF('INVOER JUDOKA''S'!BA28>0,'INVOER JUDOKA''S'!BA28,0)","v":0},{"$f":"IF('INVOER JUDOKA''S'!BB28>0,'INVOER JUDOKA''S'!BB28,0)","v":0},{"$f":"IF('INVOER JUDOKA''S'!BC28>0,'INVOER JUDOKA''S'!BC28,0)","v":0},{"$f":"IF('INVOER JUDOKA''S'!BD28>0,'INVOER JUDOKA''S'!BD28,0)","v":0},{"$f":"IF('INVOER JUDOKA''S'!BE28>0,'INVOER JUDOKA''S'!BE28,0)","v":0},{"$f":"IF('INVOER JUDOKA''S'!BF28>0,'INVOER JUDOKA''S'!BF28,0)","v":0},{"$f":"IF('INVOER JUDOKA''S'!BG28>0,'INVOER JUDOKA''S'!BG28,0)","v":0},{"$f":"IF('INVOER JUDOKA''S'!BH28>0,'INVOER JUDOKA''S'!BH28,0)","v":0}]
[null,{"$f":"IF('INVOER JUDOKA''S'!AP29>0,'INVOER JUDOKA''S'!AP29,0)","v":0},{"$f":"IF('INVOER JUDOKA''S'!AQ29>0,'INVOER JUDOKA''S'!AQ29,0)","v":0},{"$f":"IF('INVOER JUDOKA''S'!AR29>0,'INVOER JUDOKA''S'!AR29,0)","v":0},{"$f":"IF('INVOER JUDOKA''S'!AS29>0,'INVOER JUDOKA''S'!AS29,0)","v":0},{"$f":"IF('INVOER JUDOKA''S'!AT29>0,'INVOER JUDOKA''S'!AT29,0)","v":0},{"$f":"IF('INVOER JUDOKA''S'!AU29>0,'INVOER JUDOKA''S'!AU29,0)","v":0},{"$f":"IF('INVOER JUDOKA''S'!AV29>0,'INVOER JUDOKA''S'!AV29,0)","v":0},{"$f":"IF('INVOER JUDOKA''S'!AW29>0,'INVOER JUDOKA''S'!AW29,0)","v":0},{"$f":"IF('INVOER JUDOKA''S'!AX29>0,'INVOER JUDOKA''S'!AX29,0)","v":0},{"$f":"IF('INVOER JUDOKA''S'!AY29>0,'INVOER JUDOKA''S'!AY29,0)","v":0},{"$f":"IF('INVOER JUDOKA''S'!AZ29>0,'INVOER JUDOKA''S'!AZ29,0)","v":0},{"$f":"IF('INVOER JUDOKA''S'!BA29>0,'INVOER JUDOKA''S'!BA29,0)","v":0},{"$f":"IF('INVOER JUDOKA''S'!BB29>0,'INVOER JUDOKA''S'!BB29,0)","v":0},{"$f":"IF('INVOER JUDOKA''S'!BC29>0,'INVOER JUDOKA''S'!BC29,0)","v":0},{"$f":"IF('INVOER JUDOKA''S'!BD29>0,'INVOER JUDOKA''S'!BD29,0)","v":0},{"$f":"IF('INVOER JUDOKA''S'!BE29>0,'INVOER JUDOKA''S'!BE29,0)","v":0},{"$f":"IF('INVOER JUDOKA''S'!BF29>0,'INVOER JUDOKA''S'!BF29,0)","v":0},{"$f":"IF('INVOER JUDOKA''S'!BG29>0,'INVOER JUDOKA''S'!BG29,0)","v":0},{"$f":"IF('INVOER JUDOKA''S'!BH29>0,'INVOER JUDOKA''S'!BH29,0)","v":0}]
[null,{"$f":"IF('INVOER JUDOKA''S'!AP30>0,'INVOER JUDOKA''S'!AP30,0)","v":0},{"$f":"IF('INVOER JUDOKA''S'!AQ30>0,'INVOER JUDOKA''S'!AQ30,0)","v":0},{"$f":"IF('INVOER JUDOKA''S'!AR30>0,'INVOER JUDOKA''S'!AR30,0)","v":0},{"$f":"IF('INVOER JUDOKA''S'!AS30>0,'INVOER JUDOKA''S'!AS30,0)","v":0},{"$f":"IF('INVOER JUDOKA''S'!AT30>0,'INVOER JUDOKA''S'!AT30,0)","v":0},{"$f":"IF('INVOER JUDOKA''S'!AU30>0,'INVOER JUDOKA''S'!AU30,0)","v":0},{"$f":"IF('INVOER JUDOKA''S'!AV30>0,'INVOER JUDOKA''S'!AV30,0)","v":0},{"$f":"IF('INVOER JUDOKA''S'!AW30>0,'INVOER JUDOKA''S'!AW30,0)","v":0},{"$f":"IF('INVOER JUDOKA''S'!AX30>0,'INVOER JUDOKA''S'!AX30,0)","v":0},{"$f":"IF('INVOER JUDOKA''S'!AY30>0,'INVOER JUDOKA''S'!AY30,0)","v":0},{"$f":"IF('INVOER JUDOKA''S'!AZ30>0,'INVOER JUDOKA''S'!AZ30,0)","v":0},{"$f":"IF('INVOER JUDOKA''S'!BA30>0,'INVOER JUDOKA''S'!BA30,0)","v":0},{"$f":"IF('INVOER JUDOKA''S'!BB30>0,'INVOER JUDOKA''S'!BB30,0)","v":0},{"$f":"IF('INVOER JUDOKA''S'!BC30>0,'INVOER JUDOKA''S'!BC30,0)","v":0},{"$f":"IF('INVOER JUDOKA''S'!BD30>0,'INVOER JUDOKA''S'!BD30,0)","v":0},{"$f":"IF('INVOER JUDOKA''S'!BE30>0,'INVOER JUDOKA''S'!BE30,0)","v":0},{"$f":"IF('INVOER JUDOKA''S'!BF30>0,'INVOER JUDOKA''S'!BF30,0)","v":0},{"$f":"IF('INVOER JUDOKA''S'!BG30>0,'INVOER JUDOKA''S'!BG30,0)","v":0},{"$f":"IF('INVOER JUDOKA''S'!BH30>0,'INVOER JUDOKA''S'!BH30,0)","v":0}]
[null,{"$f":"IF('INVOER JUDOKA''S'!AP31>0,'INVOER JUDOKA''S'!AP31,0)","v":0},{"$f":"IF('INVOER JUDOKA''S'!AQ31>0,'INVOER JUDOKA''S'!AQ31,0)","v":0},{"$f":"IF('INVOER JUDOKA''S'!AR31>0,'INVOER JUDOKA''S'!AR31,0)","v":0},{"$f":"IF('INVOER JUDOKA''S'!AS31>0,'INVOER JUDOKA''S'!AS31,0)","v":0},{"$f":"IF('INVOER JUDOKA''S'!AT31>0,'INVOER JUDOKA''S'!AT31,0)","v":0},{"$f":"IF('INVOER JUDOKA''S'!AU31>0,'INVOER JUDOKA''S'!AU31,0)","v":0},{"$f":"IF('INVOER JUDOKA''S'!AV31>0,'INVOER JUDOKA''S'!AV31,0)","v":0},{"$f":"IF('INVOER JUDOKA''S'!AW31>0,'INVOER JUDOKA''S'!AW31,0)","v":0},{"$f":"IF('INVOER JUDOKA''S'!AX31>0,'INVOER JUDOKA''S'!AX31,0)","v":0},{"$f":"IF('INVOER JUDOKA''S'!AY31>0,'INVOER JUDOKA''S'!AY31,0)","v":0},{"$f":"IF('INVOER JUDOKA''S'!AZ31>0,'INVOER JUDOKA''S'!AZ31,0)","v":0},{"$f":"IF('INVOER JUDOKA''S'!BA31>0,'INVOER JUDOKA''S'!BA31,0)","v":0},{"$f":"IF('INVOER JUDOKA''S'!BB31>0,'INVOER JUDOKA''S'!BB31,0)","v":0},{"$f":"IF('INVOER JUDOKA''S'!BC31>0,'INVOER JUDOKA''S'!BC31,0)","v":0},{"$f":"IF('INVOER JUDOKA''S'!BD31>0,'INVOER JUDOKA''S'!BD31,0)","v":0},{"$f":"IF('INVOER JUDOKA''S'!BE31>0,'INVOER JUDOKA''S'!BE31,0)","v":0},{"$f":"IF('INVOER JUDOKA''S'!BF31>0,'INVOER JUDOKA''S'!BF31,0)","v":0},{"$f":"IF('INVOER JUDOKA''S'!BG31>0,'INVOER JUDOKA''S'!BG31,0)","v":0},{"$f":"IF('INVOER JUDOKA''S'!BH31>0,'INVOER JUDOKA''S'!BH31,0)","v":0}]
[null,{"$f":"IF('INVOER JUDOKA''S'!AP32>0,'INVOER JUDOKA''S'!AP32,0)","v":0},{"$f":"IF('INVOER JUDOKA''S'!AQ32>0,'INVOER JUDOKA''S'!AQ32,0)","v":0},{"$f":"IF('INVOER JUDOKA''S'!AR32>0,'INVOER JUDOKA''S'!AR32,0)","v":0},{"$f":"IF('INVOER JUDOKA''S'!AS32>0,'INVOER JUDOKA''S'!AS32,0)","v":0},{"$f":"IF('INVOER JUDOKA''S'!AT32>0,'INVOER JUDOKA''S'!AT32,0)","v":0},{"$f":"IF('INVOER JUDOKA''S'!AU32>0,'INVOER JUDOKA''S'!AU32,0)","v":0},{"$f":"IF('INVOER JUDOKA''S'!AV32>0,'INVOER JUDOKA''S'!AV32,0)","v":0},{"$f":"IF('INVOER JUDOKA''S'!AW32>0,'INVOER JUDOKA''S'!AW32,0)","v":0},{"$f":"IF('INVOER JUDOKA''S'!AX32>0,'INVOER JUDOKA''S'!AX32,0)","v":0},{"$f":"IF('INVOER JUDOKA''S'!AY32>0,'INVOER JUDOKA''S'!AY32,0)","v":0},{"$f":"IF('INVOER JUDOKA''S'!AZ32>0,'INVOER JUDOKA''S'!AZ32,0)","v":0},{"$f":"IF('INVOER JUDOKA''S'!BA32>0,'INVOER JUDOKA''S'!BA32,0)","v":0},{"$f":"IF('INVOER JUDOKA''S'!BB32>0,'INVOER JUDOKA''S'!BB32,0)","v":0},{"$f":"IF('INVOER JUDOKA''S'!BC32>0,'INVOER JUDOKA''S'!BC32,0)","v":0},{"$f":"IF('INVOER JUDOKA''S'!BD32>0,'INVOER JUDOKA''S'!BD32,0)","v":0},{"$f":"IF('INVOER JUDOKA''S'!BE32>0,'INVOER JUDOKA''S'!BE32,0)","v":0},{"$f":"IF('INVOER JUDOKA''S'!BF32>0,'INVOER JUDOKA''S'!BF32,0)","v":0},{"$f":"IF('INVOER JUDOKA''S'!BG32>0,'INVOER JUDOKA''S'!BG32,0)","v":0},{"$f":"IF('INVOER JUDOKA''S'!BH32>0,'INVOER JUDOKA''S'!BH32,0)","v":0}]
[null,{"$f":"IF('INVOER JUDOKA''S'!AP33>0,'INVOER JUDOKA''S'!AP33,0)","v":0},{"$f":"IF('INVOER JUDOKA''S'!AQ33>0,'INVOER JUDOKA''S'!AQ33,0)","v":0},{"$f":"IF('INVOER JUDOKA''S'!AR33>0,'INVOER JUDOKA''S'!AR33,0)","v":0},{"$f":"IF('INVOER JUDOKA''S'!AS33>0,'INVOER JUDOKA''S'!AS33,0)","v":0},{"$f":"IF('INVOER JUDOKA''S'!AT33>0,'INVOER JUDOKA''S'!AT33,0)","v":0},{"$f":"IF('INVOER JUDOKA''S'!AU33>0,'INVOER JUDOKA''S'!AU33,0)","v":0},{"$f":"IF('INVOER JUDOKA''S'!AV33>0,'INVOER JUDOKA''S'!AV33,0)","v":0},{"$f":"IF('INVOER JUDOKA''S'!AW33>0,'INVOER JUDOKA''S'!AW33,0)","v":0},{"$f":"IF('INVOER JUDOKA''S'!AX33>0,'INVOER JUDOKA''S'!AX33,0)","v":0},{"$f":"IF('INVOER JUDOKA''S'!AY33>0,'INVOER JUDOKA''S'!AY33,0)","v":0},{"$f":"IF('INVOER JUDOKA''S'!AZ33>0,'INVOER JUDOKA''S'!AZ33,0)","v":0},{"$f":"IF('INVOER JUDOKA''S'!BA33>0,'INVOER JUDOKA''S'!BA33,0)","v":0},{"$f":"IF('INVOER JUDOKA''S'!BB33>0,'INVOER JUDOKA''S'!BB33,0)","v":0},{"$f":"IF('INVOER JUDOKA''S'!BC33>0,'INVOER JUDOKA''S'!BC33,0)","v":0},{"$f":"IF('INVOER JUDOKA''S'!BD33>0,'INVOER JUDOKA''S'!BD33,0)","v":0},{"$f":"IF('INVOER JUDOKA''S'!BE33>0,'INVOER JUDOKA''S'!BE33,0)","v":0},{"$f":"IF('INVOER JUDOKA''S'!BF33>0,'INVOER JUDOKA''S'!BF33,0)","v":0},{"$f":"IF('INVOER JUDOKA''S'!BG33>0,'INVOER JUDOKA''S'!BG33,0)","v":0},{"$f":"IF('INVOER JUDOKA''S'!BH33>0,'INVOER JUDOKA''S'!BH33,0)","v":0}]
[null,{"$f":"IF('INVOER JUDOKA''S'!AP34>0,'INVOER JUDOKA''S'!AP34,0)","v":0},{"$f":"IF('INVOER JUDOKA''S'!AQ34>0,'INVOER JUDOKA''S'!AQ34,0)","v":0},{"$f":"IF('INVOER JUDOKA''S'!AR34>0,'INVOER JUDOKA''S'!AR34,0)","v":0},{"$f":"IF('INVOER JUDOKA''S'!AS34>0,'INVOER JUDOKA''S'!AS34,0)","v":0},{"$f":"IF('INVOER JUDOKA''S'!AT34>0,'INVOER JUDOKA''S'!AT34,0)","v":0},{"$f":"IF('INVOER JUDOKA''S'!AU34>0,'INVOER JUDOKA''S'!AU34,0)","v":0},{"$f":"IF('INVOER JUDOKA''S'!AV34>0,'INVOER JUDOKA''S'!AV34,0)","v":0},{"$f":"IF('INVOER JUDOKA''S'!AW34>0,'INVOER JUDOKA''S'!AW34,0)","v":0},{"$f":"IF('INVOER JUDOKA''S'!AX34>0,'INVOER JUDOKA''S'!AX34,0)","v":0},{"$f":"IF('INVOER JUDOKA''S'!AY34>0,'INVOER JUDOKA''S'!AY34,0)","v":0},{"$f":"IF('INVOER JUDOKA''S'!AZ34>0,'INVOER JUDOKA''S'!AZ34,0)","v":0},{"$f":"IF('INVOER JUDOKA''S'!BA34>0,'INVOER JUDOKA''S'!BA34,0)","v":0},{"$f":"IF('INVOER JUDOKA''S'!BB34>0,'INVOER JUDOKA''S'!BB34,0)","v":0},{"$f":"IF('INVOER JUDOKA''S'!BC34>0,'INVOER JUDOKA''S'!BC34,0)","v":0},{"$f":"IF('INVOER JUDOKA''S'!BD34>0,'INVOER JUDOKA''S'!BD34,0)","v":0},{"$f":"IF('INVOER JUDOKA''S'!BE34>0,'INVOER JUDOKA''S'!BE34,0)","v":0},{"$f":"IF('INVOER JUDOKA''S'!BF34>0,'INVOER JUDOKA''S'!BF34,0)","v":0},{"$f":"IF('INVOER JUDOKA''S'!BG34>0,'INVOER JUDOKA''S'!BG34,0)","v":0},{"$f":"IF('INVOER JUDOKA''S'!BH34>0,'INVOER JUDOKA''S'!BH34,0)","v":0}]
[null,{"$f":"IF('INVOER JUDOKA''S'!AP35>0,'INVOER JUDOKA''S'!AP35,0)","v":0},{"$f":"IF('INVOER JUDOKA''S'!AQ35>0,'INVOER JUDOKA''S'!AQ35,0)","v":0},{"$f":"IF('INVOER JUDOKA''S'!AR35>0,'INVOER JUDOKA''S'!AR35,0)","v":0},{"$f":"IF('INVOER JUDOKA''S'!AS35>0,'INVOER JUDOKA''S'!AS35,0)","v":0},{"$f":"IF('INVOER JUDOKA''S'!AT35>0,'INVOER JUDOKA''S'!AT35,0)","v":0},{"$f":"IF('INVOER JUDOKA''S'!AU35>0,'INVOER JUDOKA''S'!AU35,0)","v":0},{"$f":"IF('INVOER JUDOKA''S'!AV35>0,'INVOER JUDOKA''S'!AV35,0)","v":0},{"$f":"IF('INVOER JUDOKA''S'!AW35>0,'INVOER JUDOKA''S'!AW35,0)","v":0},{"$f":"IF('INVOER JUDOKA''S'!AX35>0,'INVOER JUDOKA''S'!AX35,0)","v":0},{"$f":"IF('INVOER JUDOKA''S'!AY35>0,'INVOER JUDOKA''S'!AY35,0)","v":0},{"$f":"IF('INVOER JUDOKA''S'!AZ35>0,'INVOER JUDOKA''S'!AZ35,0)","v":0},{"$f":"IF('INVOER JUDOKA''S'!BA35>0,'INVOER JUDOKA''S'!BA35,0)","v":0},{"$f":"IF('INVOER JUDOKA''S'!BB35>0,'INVOER JUDOKA''S'!BB35,0)","v":0},{"$f":"IF('INVOER JUDOKA''S'!BC35>0,'INVOER JUDOKA''S'!BC35,0)","v":0},{"$f":"IF('INVOER JUDOKA''S'!BD35>0,'INVOER JUDOKA''S'!BD35,0)","v":0},{"$f":"IF('INVOER JUDOKA''S'!BE35>0,'INVOER JUDOKA''S'!BE35,0)","v":0},{"$f":"IF('INVOER JUDOKA''S'!BF35>0,'INVOER JUDOKA''S'!BF35,0)","v":0},{"$f":"IF('INVOER JUDOKA''S'!BG35>0,'INVOER JUDOKA''S'!BG35,0)","v":0},{"$f":"IF('INVOER JUDOKA''S'!BH35>0,'INVOER JUDOKA''S'!BH35,0)","v":0}]
[null,{"$f":"IF('INVOER JUDOKA''S'!AP36>0,'INVOER JUDOKA''S'!AP36,0)","v":0},{"$f":"IF('INVOER JUDOKA''S'!AQ36>0,'INVOER JUDOKA''S'!AQ36,0)","v":0},{"$f":"IF('INVOER JUDOKA''S'!AR36>0,'INVOER JUDOKA''S'!AR36,0)","v":0},{"$f":"IF('INVOER JUDOKA''S'!AS36>0,'INVOER JUDOKA''S'!AS36,0)","v":0},{"$f":"IF('INVOER JUDOKA''S'!AT36>0,'INVOER JUDOKA''S'!AT36,0)","v":0},{"$f":"IF('INVOER JUDOKA''S'!AU36>0,'INVOER JUDOKA''S'!AU36,0)","v":0},{"$f":"IF('INVOER JUDOKA''S'!AV36>0,'INVOER JUDOKA''S'!AV36,0)","v":0},{"$f":"IF('INVOER JUDOKA''S'!AW36>0,'INVOER JUDOKA''S'!AW36,0)","v":0},{"$f":"IF('INVOER JUDOKA''S'!AX36>0,'INVOER JUDOKA''S'!AX36,0)","v":0},{"$f":"IF('INVOER JUDOKA''S'!AY36>0,'INVOER JUDOKA''S'!AY36,0)","v":0},{"$f":"IF('INVOER JUDOKA''S'!AZ36>0,'INVOER JUDOKA''S'!AZ36,0)","v":0},{"$f":"IF('INVOER JUDOKA''S'!BA36>0,'INVOER JUDOKA''S'!BA36,0)","v":0},{"$f":"IF('INVOER JUDOKA''S'!BB36>0,'INVOER JUDOKA''S'!BB36,0)","v":0},{"$f":"IF('INVOER JUDOKA''S'!BC36>0,'INVOER JUDOKA''S'!BC36,0)","v":0},{"$f":"IF('INVOER JUDOKA''S'!BD36>0,'INVOER JUDOKA''S'!BD36,0)","v":0},{"$f":"IF('INVOER JUDOKA''S'!BE36>0,'INVOER JUDOKA''S'!BE36,0)","v":0},{"$f":"IF('INVOER JUDOKA''S'!BF36>0,'INVOER JUDOKA''S'!BF36,0)","v":0},{"$f":"IF('INVOER JUDOKA''S'!BG36>0,'INVOER JUDOKA''S'!BG36,0)","v":0},{"$f":"IF('INVOER JUDOKA''S'!BH36>0,'INVOER JUDOKA''S'!BH36,0)","v":0}]
[null,{"$f":"IF('INVOER JUDOKA''S'!AP37>0,'INVOER JUDOKA''S'!AP37,0)","v":0},{"$f":"IF('INVOER JUDOKA''S'!AQ37>0,'INVOER JUDOKA''S'!AQ37,0)","v":0},{"$f":"IF('INVOER JUDOKA''S'!AR37>0,'INVOER JUDOKA''S'!AR37,0)","v":0},{"$f":"IF('INVOER JUDOKA''S'!AS37>0,'INVOER JUDOKA''S'!AS37,0)","v":0},{"$f":"IF('INVOER JUDOKA''S'!AT37>0,'INVOER JUDOKA''S'!AT37,0)","v":0},{"$f":"IF('INVOER JUDOKA''S'!AU37>0,'INVOER JUDOKA''S'!AU37,0)","v":0},{"$f":"IF('INVOER JUDOKA''S'!AV37>0,'INVOER JUDOKA''S'!AV37,0)","v":0},{"$f":"IF('INVOER JUDOKA''S'!AW37>0,'INVOER JUDOKA''S'!AW37,0)","v":0},{"$f":"IF('INVOER JUDOKA''S'!AX37>0,'INVOER JUDOKA''S'!AX37,0)","v":0},{"$f":"IF('INVOER JUDOKA''S'!AY37>0,'INVOER JUDOKA''S'!AY37,0)","v":0},{"$f":"IF('INVOER JUDOKA''S'!AZ37>0,'INVOER JUDOKA''S'!AZ37,0)","v":0},{"$f":"IF('INVOER JUDOKA''S'!BA37>0,'INVOER JUDOKA''S'!BA37,0)","v":0},{"$f":"IF('INVOER JUDOKA''S'!BB37>0,'INVOER JUDOKA''S'!BB37,0)","v":0},{"$f":"IF('INVOER JUDOKA''S'!BC37>0,'INVOER JUDOKA''S'!BC37,0)","v":0},{"$f":"IF('INVOER JUDOKA''S'!BD37>0,'INVOER JUDOKA''S'!BD37,0)","v":0},{"$f":"IF('INVOER JUDOKA''S'!BE37>0,'INVOER JUDOKA''S'!BE37,0)","v":0},{"$f":"IF('INVOER JUDOKA''S'!BF37>0,'INVOER JUDOKA''S'!BF37,0)","v":0},{"$f":"IF('INVOER JUDOKA''S'!BG37>0,'INVOER JUDOKA''S'!BG37,0)","v":0},{"$f":"IF('INVOER JUDOKA''S'!BH37>0,'INVOER JUDOKA''S'!BH37,0)","v":0}]
[null,{"$f":"IF('INVOER JUDOKA''S'!AP38>0,'INVOER JUDOKA''S'!AP38,0)","v":0},{"$f":"IF('INVOER JUDOKA''S'!AQ38>0,'INVOER JUDOKA''S'!AQ38,0)","v":0},{"$f":"IF('INVOER JUDOKA''S'!AR38>0,'INVOER JUDOKA''S'!AR38,0)","v":0},{"$f":"IF('INVOER JUDOKA''S'!AS38>0,'INVOER JUDOKA''S'!AS38,0)","v":0},{"$f":"IF('INVOER JUDOKA''S'!AT38>0,'INVOER JUDOKA''S'!AT38,0)","v":0},{"$f":"IF('INVOER JUDOKA''S'!AU38>0,'INVOER JUDOKA''S'!AU38,0)","v":0},{"$f":"IF('INVOER JUDOKA''S'!AV38>0,'INVOER JUDOKA''S'!AV38,0)","v":0},{"$f":"IF('INVOER JUDOKA''S'!AW38>0,'INVOER JUDOKA''S'!AW38,0)","v":0},{"$f":"IF('INVOER JUDOKA''S'!AX38>0,'INVOER JUDOKA''S'!AX38,0)","v":0},{"$f":"IF('INVOER JUDOKA''S'!AY38>0,'INVOER JUDOKA''S'!AY38,0)","v":0},{"$f":"IF('INVOER JUDOKA''S'!AZ38>0,'INVOER JUDOKA''S'!AZ38,0)","v":0},{"$f":"IF('INVOER JUDOKA''S'!BA38>0,'INVOER JUDOKA''S'!BA38,0)","v":0},{"$f":"IF('INVOER JUDOKA''S'!BB38>0,'INVOER JUDOKA''S'!BB38,0)","v":0},{"$f":"IF('INVOER JUDOKA''S'!BC38>0,'INVOER JUDOKA''S'!BC38,0)","v":0},{"$f":"IF('INVOER JUDOKA''S'!BD38>0,'INVOER JUDOKA''S'!BD38,0)","v":0},{"$f":"IF('INVOER JUDOKA''S'!BE38>0,'INVOER JUDOKA''S'!BE38,0)","v":0},{"$f":"IF('INVOER JUDOKA''S'!BF38>0,'INVOER JUDOKA''S'!BF38,0)","v":0},{"$f":"IF('INVOER JUDOKA''S'!BG38>0,'INVOER JUDOKA''S'!BG38,0)","v":0},{"$f":"IF('INVOER JUDOKA''S'!BH38>0,'INVOER JUDOKA''S'!BH38,0)","v":0}]
[null,{"$f":"IF('INVOER JUDOKA''S'!AP39>0,'INVOER JUDOKA''S'!AP39,0)","v":0},{"$f":"IF('INVOER JUDOKA''S'!AQ39>0,'INVOER JUDOKA''S'!AQ39,0)","v":0},{"$f":"IF('INVOER JUDOKA''S'!AR39>0,'INVOER JUDOKA''S'!AR39,0)","v":0},{"$f":"IF('INVOER JUDOKA''S'!AS39>0,'INVOER JUDOKA''S'!AS39,0)","v":0},{"$f":"IF('INVOER JUDOKA''S'!AT39>0,'INVOER JUDOKA''S'!AT39,0)","v":0},{"$f":"IF('INVOER JUDOKA''S'!AU39>0,'INVOER JUDOKA''S'!AU39,0)","v":0},{"$f":"IF('INVOER JUDOKA''S'!AV39>0,'INVOER JUDOKA''S'!AV39,0)","v":0},{"$f":"IF('INVOER JUDOKA''S'!AW39>0,'INVOER JUDOKA''S'!AW39,0)","v":0},{"$f":"IF('INVOER JUDOKA''S'!AX39>0,'INVOER JUDOKA''S'!AX39,0)","v":0},{"$f":"IF('INVOER JUDOKA''S'!AY39>0,'INVOER JUDOKA''S'!AY39,0)","v":0},{"$f":"IF('INVOER JUDOKA''S'!AZ39>0,'INVOER JUDOKA''S'!AZ39,0)","v":0},{"$f":"IF('INVOER JUDOKA''S'!BA39>0,'INVOER JUDOKA''S'!BA39,0)","v":0},{"$f":"IF('INVOER JUDOKA''S'!BB39>0,'INVOER JUDOKA''S'!BB39,0)","v":0},{"$f":"IF('INVOER JUDOKA''S'!BC39>0,'INVOER JUDOKA''S'!BC39,0)","v":0},{"$f":"IF('INVOER JUDOKA''S'!BD39>0,'INVOER JUDOKA''S'!BD39,0)","v":0},{"$f":"IF('INVOER JUDOKA''S'!BE39>0,'INVOER JUDOKA''S'!BE39,0)","v":0},{"$f":"IF('INVOER JUDOKA''S'!BF39>0,'INVOER JUDOKA''S'!BF39,0)","v":0},{"$f":"IF('INVOER JUDOKA''S'!BG39>0,'INVOER JUDOKA''S'!BG39,0)","v":0},{"$f":"IF('INVOER JUDOKA''S'!BH39>0,'INVOER JUDOKA''S'!BH39,0)","v":0}]
[null,{"$f":"IF('INVOER JUDOKA''S'!AP40>0,'INVOER JUDOKA''S'!AP40,0)","v":0},{"$f":"IF('INVOER JUDOKA''S'!AQ40>0,'INVOER JUDOKA''S'!AQ40,0)","v":0},{"$f":"IF('INVOER JUDOKA''S'!AR40>0,'INVOER JUDOKA''S'!AR40,0)","v":0},{"$f":"IF('INVOER JUDOKA''S'!AS40>0,'INVOER JUDOKA''S'!AS40,0)","v":0},{"$f":"IF('INVOER JUDOKA''S'!AT40>0,'INVOER JUDOKA''S'!AT40,0)","v":0},{"$f":"IF('INVOER JUDOKA''S'!AU40>0,'INVOER JUDOKA''S'!AU40,0)","v":0},{"$f":"IF('INVOER JUDOKA''S'!AV40>0,'INVOER JUDOKA''S'!AV40,0)","v":0},{"$f":"IF('INVOER JUDOKA''S'!AW40>0,'INVOER JUDOKA''S'!AW40,0)","v":0},{"$f":"IF('INVOER JUDOKA''S'!AX40>0,'INVOER JUDOKA''S'!AX40,0)","v":0},{"$f":"IF('INVOER JUDOKA''S'!AY40>0,'INVOER JUDOKA''S'!AY40,0)","v":0},{"$f":"IF('INVOER JUDOKA''S'!AZ40>0,'INVOER JUDOKA''S'!AZ40,0)","v":0},{"$f":"IF('INVOER JUDOKA''S'!BA40>0,'INVOER JUDOKA''S'!BA40,0)","v":0},{"$f":"IF('INVOER JUDOKA''S'!BB40>0,'INVOER JUDOKA''S'!BB40,0)","v":0},{"$f":"IF('INVOER JUDOKA''S'!BC40>0,'INVOER JUDOKA''S'!BC40,0)","v":0},{"$f":"IF('INVOER JUDOKA''S'!BD40>0,'INVOER JUDOKA''S'!BD40,0)","v":0},{"$f":"IF('INVOER JUDOKA''S'!BE40>0,'INVOER JUDOKA''S'!BE40,0)","v":0},{"$f":"IF('INVOER JUDOKA''S'!BF40>0,'INVOER JUDOKA''S'!BF40,0)","v":0},{"$f":"IF('INVOER JUDOKA''S'!BG40>0,'INVOER JUDOKA''S'!BG40,0)","v":0},{"$f":"IF('INVOER JUDOKA''S'!BH40>0,'INVOER JUDOKA''S'!BH40,0)","v":0}]
[null,{"$f":"IF('INVOER JUDOKA''S'!AP41>0,'INVOER JUDOKA''S'!AP41,0)","v":0},{"$f":"IF('INVOER JUDOKA''S'!AQ41>0,'INVOER JUDOKA''S'!AQ41,0)","v":0},{"$f":"IF('INVOER JUDOKA''S'!AR41>0,'INVOER JUDOKA''S'!AR41,0)","v":0},{"$f":"IF('INVOER JUDOKA''S'!AS41>0,'INVOER JUDOKA''S'!AS41,0)","v":0},{"$f":"IF('INVOER JUDOKA''S'!AT41>0,'INVOER JUDOKA''S'!AT41,0)","v":0},{"$f":"IF('INVOER JUDOKA''S'!AU41>0,'INVOER JUDOKA''S'!AU41,0)","v":0},{"$f":"IF('INVOER JUDOKA''S'!AV41>0,'INVOER JUDOKA''S'!AV41,0)","v":0},{"$f":"IF('INVOER JUDOKA''S'!AW41>0,'INVOER JUDOKA''S'!AW41,0)","v":0},{"$f":"IF('INVOER JUDOKA''S'!AX41>0,'INVOER JUDOKA''S'!AX41,0)","v":0},{"$f":"IF('INVOER JUDOKA''S'!AY41>0,'INVOER JUDOKA''S'!AY41,0)","v":0},{"$f":"IF('INVOER JUDOKA''S'!AZ41>0,'INVOER JUDOKA''S'!AZ41,0)","v":0},{"$f":"IF('INVOER JUDOKA''S'!BA41>0,'INVOER JUDOKA''S'!BA41,0)","v":0},{"$f":"IF('INVOER JUDOKA''S'!BB41>0,'INVOER JUDOKA''S'!BB41,0)","v":0},{"$f":"IF('INVOER JUDOKA''S'!BC41>0,'INVOER JUDOKA''S'!BC41,0)","v":0},{"$f":"IF('INVOER JUDOKA''S'!BD41>0,'INVOER JUDOKA''S'!BD41,0)","v":0},{"$f":"IF('INVOER JUDOKA''S'!BE41>0,'INVOER JUDOKA''S'!BE41,0)","v":0},{"$f":"IF('INVOER JUDOKA''S'!BF41>0,'INVOER JUDOKA''S'!BF41,0)","v":0},{"$f":"IF('INVOER JUDOKA''S'!BG41>0,'INVOER JUDOKA''S'!BG41,0)","v":0},{"$f":"IF('INVOER JUDOKA''S'!BH41>0,'INVOER JUDOKA''S'!BH41,0)","v":0}]
[null,{"$f":"IF('INVOER JUDOKA''S'!AP42>0,'INVOER JUDOKA''S'!AP42,0)","v":0},{"$f":"IF('INVOER JUDOKA''S'!AQ42>0,'INVOER JUDOKA''S'!AQ42,0)","v":0},{"$f":"IF('INVOER JUDOKA''S'!AR42>0,'INVOER JUDOKA''S'!AR42,0)","v":0},{"$f":"IF('INVOER JUDOKA''S'!AS42>0,'INVOER JUDOKA''S'!AS42,0)","v":0},{"$f":"IF('INVOER JUDOKA''S'!AT42>0,'INVOER JUDOKA''S'!AT42,0)","v":0},{"$f":"IF('INVOER JUDOKA''S'!AU42>0,'INVOER JUDOKA''S'!AU42,0)","v":0},{"$f":"IF('INVOER JUDOKA''S'!AV42>0,'INVOER JUDOKA''S'!AV42,0)","v":0},{"$f":"IF('INVOER JUDOKA''S'!AW42>0,'INVOER JUDOKA''S'!AW42,0)","v":0},{"$f":"IF('INVOER JUDOKA''S'!AX42>0,'INVOER JUDOKA''S'!AX42,0)","v":0},{"$f":"IF('INVOER JUDOKA''S'!AY42>0,'INVOER JUDOKA''S'!AY42,0)","v":0},{"$f":"IF('INVOER JUDOKA''S'!AZ42>0,'INVOER JUDOKA''S'!AZ42,0)","v":0},{"$f":"IF('INVOER JUDOKA''S'!BA42>0,'INVOER JUDOKA''S'!BA42,0)","v":0},{"$f":"IF('INVOER JUDOKA''S'!BB42>0,'INVOER JUDOKA''S'!BB42,0)","v":0},{"$f":"IF('INVOER JUDOKA''S'!BC42>0,'INVOER JUDOKA''S'!BC42,0)","v":0},{"$f":"IF('INVOER JUDOKA''S'!BD42>0,'INVOER JUDOKA''S'!BD42,0)","v":0},{"$f":"IF('INVOER JUDOKA''S'!BE42>0,'INVOER JUDOKA''S'!BE42,0)","v":0},{"$f":"IF('INVOER JUDOKA''S'!BF42>0,'INVOER JUDOKA''S'!BF42,0)","v":0},{"$f":"IF('INVOER JUDOKA''S'!BG42>0,'INVOER JUDOKA''S'!BG42,0)","v":0},{"$f":"IF('INVOER JUDOKA''S'!BH42>0,'INVOER JUDOKA''S'!BH42,0)","v":0}]
[null,{"$f":"IF('INVOER JUDOKA''S'!AP43>0,'INVOER JUDOKA''S'!AP43,0)","v":0},{"$f":"IF('INVOER JUDOKA''S'!AQ43>0,'INVOER JUDOKA''S'!AQ43,0)","v":0},{"$f":"IF('INVOER JUDOKA''S'!AR43>0,'INVOER JUDOKA''S'!AR43,0)","v":0},{"$f":"IF('INVOER JUDOKA''S'!AS43>0,'INVOER JUDOKA''S'!AS43,0)","v":0},{"$f":"IF('INVOER JUDOKA''S'!AT43>0,'INVOER JUDOKA''S'!AT43,0)","v":0},{"$f":"IF('INVOER JUDOKA''S'!AU43>0,'INVOER JUDOKA''S'!AU43,0)","v":0},{"$f":"IF('INVOER JUDOKA''S'!AV43>0,'INVOER JUDOKA''S'!AV43,0)","v":0},{"$f":"IF('INVOER JUDOKA''S'!AW43>0,'INVOER JUDOKA''S'!AW43,0)","v":0},{"$f":"IF('INVOER JUDOKA''S'!AX43>0,'INVOER JUDOKA''S'!AX43,0)","v":0},{"$f":"IF('INVOER JUDOKA''S'!AY43>0,'INVOER JUDOKA''S'!AY43,0)","v":0},{"$f":"IF('INVOER JUDOKA''S'!AZ43>0,'INVOER JUDOKA''S'!AZ43,0)","v":0},{"$f":"IF('INVOER JUDOKA''S'!BA43>0,'INVOER JUDOKA''S'!BA43,0)","v":0},{"$f":"IF('INVOER JUDOKA''S'!BB43>0,'INVOER JUDOKA''S'!BB43,0)","v":0},{"$f":"IF('INVOER JUDOKA''S'!BC43>0,'INVOER JUDOKA''S'!BC43,0)","v":0},{"$f":"IF('INVOER JUDOKA''S'!BD43>0,'INVOER JUDOKA''S'!BD43,0)","v":0},{"$f":"IF('INVOER JUDOKA''S'!BE43>0,'INVOER JUDOKA''S'!BE43,0)","v":0},{"$f":"IF('INVOER JUDOKA''S'!BF43>0,'INVOER JUDOKA''S'!BF43,0)","v":0},{"$f":"IF('INVOER JUDOKA''S'!BG43>0,'INVOER JUDOKA''S'!BG43,0)","v":0},{"$f":"IF('INVOER JUDOKA''S'!BH43>0,'INVOER JUDOKA''S'!BH43,0)","v":0}]
[null,{"$f":"IF('INVOER JUDOKA''S'!AP44>0,'INVOER JUDOKA''S'!AP44,0)","v":0},{"$f":"IF('INVOER JUDOKA''S'!AQ44>0,'INVOER JUDOKA''S'!AQ44,0)","v":0},{"$f":"IF('INVOER JUDOKA''S'!AR44>0,'INVOER JUDOKA''S'!AR44,0)","v":0},{"$f":"IF('INVOER JUDOKA''S'!AS44>0,'INVOER JUDOKA''S'!AS44,0)","v":0},{"$f":"IF('INVOER JUDOKA''S'!AT44>0,'INVOER JUDOKA''S'!AT44,0)","v":0},{"$f":"IF('INVOER JUDOKA''S'!AU44>0,'INVOER JUDOKA''S'!AU44,0)","v":0},{"$f":"IF('INVOER JUDOKA''S'!AV44>0,'INVOER JUDOKA''S'!AV44,0)","v":0},{"$f":"IF('INVOER JUDOKA''S'!AW44>0,'INVOER JUDOKA''S'!AW44,0)","v":0},{"$f":"IF('INVOER JUDOKA''S'!AX44>0,'INVOER JUDOKA''S'!AX44,0)","v":0},{"$f":"IF('INVOER JUDOKA''S'!AY44>0,'INVOER JUDOKA''S'!AY44,0)","v":0},{"$f":"IF('INVOER JUDOKA''S'!AZ44>0,'INVOER JUDOKA''S'!AZ44,0)","v":0},{"$f":"IF('INVOER JUDOKA''S'!BA44>0,'INVOER JUDOKA''S'!BA44,0)","v":0},{"$f":"IF('INVOER JUDOKA''S'!BB44>0,'INVOER JUDOKA''S'!BB44,0)","v":0},{"$f":"IF('INVOER JUDOKA''S'!BC44>0,'INVOER JUDOKA''S'!BC44,0)","v":0},{"$f":"IF('INVOER JUDOKA''S'!BD44>0,'INVOER JUDOKA''S'!BD44,0)","v":0},{"$f":"IF('INVOER JUDOKA''S'!BE44>0,'INVOER JUDOKA''S'!BE44,0)","v":0},{"$f":"IF('INVOER JUDOKA''S'!BF44>0,'INVOER JUDOKA''S'!BF44,0)","v":0},{"$f":"IF('INVOER JUDOKA''S'!BG44>0,'INVOER JUDOKA''S'!BG44,0)","v":0},{"$f":"IF('INVOER JUDOKA''S'!BH44>0,'INVOER JUDOKA''S'!BH44,0)","v":0}]
[null,{"$f":"IF('INVOER JUDOKA''S'!AP45>0,'INVOER JUDOKA''S'!AP45,0)","v":0},{"$f":"IF('INVOER JUDOKA''S'!AQ45>0,'INVOER JUDOKA''S'!AQ45,0)","v":0},{"$f":"IF('INVOER JUDOKA''S'!AR45>0,'INVOER JUDOKA''S'!AR45,0)","v":0},{"$f":"IF('INVOER JUDOKA''S'!AS45>0,'INVOER JUDOKA''S'!AS45,0)","v":0},{"$f":"IF('INVOER JUDOKA''S'!AT45>0,'INVOER JUDOKA''S'!AT45,0)","v":0},{"$f":"IF('INVOER JUDOKA''S'!AU45>0,'INVOER JUDOKA''S'!AU45,0)","v":0},{"$f":"IF('INVOER JUDOKA''S'!AV45>0,'INVOER JUDOKA''S'!AV45,0)","v":0},{"$f":"IF('INVOER JUDOKA''S'!AW45>0,'INVOER JUDOKA''S'!AW45,0)","v":0},{"$f":"IF('INVOER JUDOKA''S'!AX45>0,'INVOER JUDOKA''S'!AX45,0)","v":0},{"$f":"IF('INVOER JUDOKA''S'!AY45>0,'INVOER JUDOKA''S'!AY45,0)","v":0},{"$f":"IF('INVOER JUDOKA''S'!AZ45>0,'INVOER JUDOKA''S'!AZ45,0)","v":0},{"$f":"IF('INVOER JUDOKA''S'!BA45>0,'INVOER JUDOKA''S'!BA45,0)","v":0},{"$f":"IF('INVOER JUDOKA''S'!BB45>0,'INVOER JUDOKA''S'!BB45,0)","v":0},{"$f":"IF('INVOER JUDOKA''S'!BC45>0,'INVOER JUDOKA''S'!BC45,0)","v":0},{"$f":"IF('INVOER JUDOKA''S'!BD45>0,'INVOER JUDOKA''S'!BD45,0)","v":0},{"$f":"IF('INVOER JUDOKA''S'!BE45>0,'INVOER JUDOKA''S'!BE45,0)","v":0},{"$f":"IF('INVOER JUDOKA''S'!BF45>0,'INVOER JUDOKA''S'!BF45,0)","v":0},{"$f":"IF('INVOER JUDOKA''S'!BG45>0,'INVOER JUDOKA''S'!BG45,0)","v":0},{"$f":"IF('INVOER JUDOKA''S'!BH45>0,'INVOER JUDOKA''S'!BH45,0)","v":0}]
[null,{"$f":"IF('INVOER JUDOKA''S'!AP46>0,'INVOER JUDOKA''S'!AP46,0)","v":0},{"$f":"IF('INVOER JUDOKA''S'!AQ46>0,'INVOER JUDOKA''S'!AQ46,0)","v":0},{"$f":"IF('INVOER JUDOKA''S'!AR46>0,'INVOER JUDOKA''S'!AR46,0)","v":0},{"$f":"IF('INVOER JUDOKA''S'!AS46>0,'INVOER JUDOKA''S'!AS46,0)","v":0},{"$f":"IF('INVOER JUDOKA''S'!AT46>0,'INVOER JUDOKA''S'!AT46,0)","v":0},{"$f":"IF('INVOER JUDOKA''S'!AU46>0,'INVOER JUDOKA''S'!AU46,0)","v":0},{"$f":"IF('INVOER JUDOKA''S'!AV46>0,'INVOER JUDOKA''S'!AV46,0)","v":0},{"$f":"IF('INVOER JUDOKA''S'!AW46>0,'INVOER JUDOKA''S'!AW46,0)","v":0},{"$f":"IF('INVOER JUDOKA''S'!AX46>0,'INVOER JUDOKA''S'!AX46,0)","v":0},{"$f":"IF('INVOER JUDOKA''S'!AY46>0,'INVOER JUDOKA''S'!AY46,0)","v":0},{"$f":"IF('INVOER JUDOKA''S'!AZ46>0,'INVOER JUDOKA''S'!AZ46,0)","v":0},{"$f":"IF('INVOER JUDOKA''S'!BA46>0,'INVOER JUDOKA''S'!BA46,0)","v":0},{"$f":"IF('INVOER JUDOKA''S'!BB46>0,'INVOER JUDOKA''S'!BB46,0)","v":0},{"$f":"IF('INVOER JUDOKA''S'!BC46>0,'INVOER JUDOKA''S'!BC46,0)","v":0},{"$f":"IF('INVOER JUDOKA''S'!BD46>0,'INVOER JUDOKA''S'!BD46,0)","v":0},{"$f":"IF('INVOER JUDOKA''S'!BE46>0,'INVOER JUDOKA''S'!BE46,0)","v":0},{"$f":"IF('INVOER JUDOKA''S'!BF46>0,'INVOER JUDOKA''S'!BF46,0)","v":0},{"$f":"IF('INVOER JUDOKA''S'!BG46>0,'INVOER JUDOKA''S'!BG46,0)","v":0},{"$f":"IF('INVOER JUDOKA''S'!BH46>0,'INVOER JUDOKA''S'!BH46,0)","v":0}]
[null,{"$f":"IF('INVOER JUDOKA''S'!AP47>0,'INVOER JUDOKA''S'!AP47,0)","v":0},{"$f":"IF('INVOER JUDOKA''S'!AQ47>0,'INVOER JUDOKA''S'!AQ47,0)","v":0},{"$f":"IF('INVOER JUDOKA''S'!AR47>0,'INVOER JUDOKA''S'!AR47,0)","v":0},{"$f":"IF('INVOER JUDOKA''S'!AS47>0,'INVOER JUDOKA''S'!AS47,0)","v":0},{"$f":"IF('INVOER JUDOKA''S'!AT47>0,'INVOER JUDOKA''S'!AT47,0)","v":0},{"$f":"IF('INVOER JUDOKA''S'!AU47>0,'INVOER JUDOKA''S'!AU47,0)","v":0},{"$f":"IF('INVOER JUDOKA''S'!AV47>0,'INVOER JUDOKA''S'!AV47,0)","v":0},{"$f":"IF('INVOER JUDOKA''S'!AW47>0,'INVOER JUDOKA''S'!AW47,0)","v":0},{"$f":"IF('INVOER JUDOKA''S'!AX47>0,'INVOER JUDOKA''S'!AX47,0)","v":0},{"$f":"IF('INVOER JUDOKA''S'!AY47>0,'INVOER JUDOKA''S'!AY47,0)","v":0},{"$f":"IF('INVOER JUDOKA''S'!AZ47>0,'INVOER JUDOKA''S'!AZ47,0)","v":0},{"$f":"IF('INVOER JUDOKA''S'!BA47>0,'INVOER JUDOKA''S'!BA47,0)","v":0},{"$f":"IF('INVOER JUDOKA''S'!BB47>0,'INVOER JUDOKA''S'!BB47,0)","v":0},{"$f":"IF('INVOER JUDOKA''S'!BC47>0,'INVOER JUDOKA''S'!BC47,0)","v":0},{"$f":"IF('INVOER JUDOKA''S'!BD47>0,'INVOER JUDOKA''S'!BD47,0)","v":0},{"$f":"IF('INVOER JUDOKA''S'!BE47>0,'INVOER JUDOKA''S'!BE47,0)","v":0},{"$f":"IF('INVOER JUDOKA''S'!BF47>0,'INVOER JUDOKA''S'!BF47,0)","v":0},{"$f":"IF('INVOER JUDOKA''S'!BG47>0,'INVOER JUDOKA''S'!BG47,0)","v":0},{"$f":"IF('INVOER JUDOKA''S'!BH47>0,'INVOER JUDOKA''S'!BH47,0)","v":0}]
[null,{"$f":"IF('INVOER JUDOKA''S'!AP48>0,'INVOER JUDOKA''S'!AP48,0)","v":0},{"$f":"IF('INVOER JUDOKA''S'!AQ48>0,'INVOER JUDOKA''S'!AQ48,0)","v":0},{"$f":"IF('INVOER JUDOKA''S'!AR48>0,'INVOER JUDOKA''S'!AR48,0)","v":0},{"$f":"IF('INVOER JUDOKA''S'!AS48>0,'INVOER JUDOKA''S'!AS48,0)","v":0},{"$f":"IF('INVOER JUDOKA''S'!AT48>0,'INVOER JUDOKA''S'!AT48,0)","v":0},{"$f":"IF('INVOER JUDOKA''S'!AU48>0,'INVOER JUDOKA''S'!AU48,0)","v":0},{"$f":"IF('INVOER JUDOKA''S'!AV48>0,'INVOER JUDOKA''S'!AV48,0)","v":0},{"$f":"IF('INVOER JUDOKA''S'!AW48>0,'INVOER JUDOKA''S'!AW48,0)","v":0},{"$f":"IF('INVOER JUDOKA''S'!AX48>0,'INVOER JUDOKA''S'!AX48,0)","v":0},{"$f":"IF('INVOER JUDOKA''S'!AY48>0,'INVOER JUDOKA''S'!AY48,0)","v":0},{"$f":"IF('INVOER JUDOKA''S'!AZ48>0,'INVOER JUDOKA''S'!AZ48,0)","v":0},{"$f":"IF('INVOER JUDOKA''S'!BA48>0,'INVOER JUDOKA''S'!BA48,0)","v":0},{"$f":"IF('INVOER JUDOKA''S'!BB48>0,'INVOER JUDOKA''S'!BB48,0)","v":0},{"$f":"IF('INVOER JUDOKA''S'!BC48>0,'INVOER JUDOKA''S'!BC48,0)","v":0},{"$f":"IF('INVOER JUDOKA''S'!BD48>0,'INVOER JUDOKA''S'!BD48,0)","v":0},{"$f":"IF('INVOER JUDOKA''S'!BE48>0,'INVOER JUDOKA''S'!BE48,0)","v":0},{"$f":"IF('INVOER JUDOKA''S'!BF48>0,'INVOER JUDOKA''S'!BF48,0)","v":0},{"$f":"IF('INVOER JUDOKA''S'!BG48>0,'INVOER JUDOKA''S'!BG48,0)","v":0},{"$f":"IF('INVOER JUDOKA''S'!BH48>0,'INVOER JUDOKA''S'!BH48,0)","v":0}]
[null,{"$f":"IF('INVOER JUDOKA''S'!AP49>0,'INVOER JUDOKA''S'!AP49,0)","v":0},{"$f":"IF('INVOER JUDOKA''S'!AQ49>0,'INVOER JUDOKA''S'!AQ49,0)","v":0},{"$f":"IF('INVOER JUDOKA''S'!AR49>0,'INVOER JUDOKA''S'!AR49,0)","v":0},{"$f":"IF('INVOER JUDOKA''S'!AS49>0,'INVOER JUDOKA''S'!AS49,0)","v":0},{"$f":"IF('INVOER JUDOKA''S'!AT49>0,'INVOER JUDOKA''S'!AT49,0)","v":0},{"$f":"IF('INVOER JUDOKA''S'!AU49>0,'INVOER JUDOKA''S'!AU49,0)","v":0},{"$f":"IF('INVOER JUDOKA''S'!AV49>0,'INVOER JUDOKA''S'!AV49,0)","v":0},{"$f":"IF('INVOER JUDOKA''S'!AW49>0,'INVOER JUDOKA''S'!AW49,0)","v":0},{"$f":"IF('INVOER JUDOKA''S'!AX49>0,'INVOER JUDOKA''S'!AX49,0)","v":0},{"$f":"IF('INVOER JUDOKA''S'!AY49>0,'INVOER JUDOKA''S'!AY49,0)","v":0},{"$f":"IF('INVOER JUDOKA''S'!AZ49>0,'INVOER JUDOKA''S'!AZ49,0)","v":0},{"$f":"IF('INVOER JUDOKA''S'!BA49>0,'INVOER JUDOKA''S'!BA49,0)","v":0},{"$f":"IF('INVOER JUDOKA''S'!BB49>0,'INVOER JUDOKA''S'!BB49,0)","v":0},{"$f":"IF('INVOER JUDOKA''S'!BC49>0,'INVOER JUDOKA''S'!BC49,0)","v":0},{"$f":"IF('INVOER JUDOKA''S'!BD49>0,'INVOER JUDOKA''S'!BD49,0)","v":0},{"$f":"IF('INVOER JUDOKA''S'!BE49>0,'INVOER JUDOKA''S'!BE49,0)","v":0},{"$f":"IF('INVOER JUDOKA''S'!BF49>0,'INVOER JUDOKA''S'!BF49,0)","v":0},{"$f":"IF('INVOER JUDOKA''S'!BG49>0,'INVOER JUDOKA''S'!BG49,0)","v":0},{"$f":"IF('INVOER JUDOKA''S'!BH49>0,'INVOER JUDOKA''S'!BH49,0)","v":0}]
[null,{"$f":"IF('INVOER JUDOKA''S'!AP50>0,'INVOER JUDOKA''S'!AP50,0)","v":0},{"$f":"IF('INVOER JUDOKA''S'!AQ50>0,'INVOER JUDOKA''S'!AQ50,0)","v":0},{"$f":"IF('INVOER JUDOKA''S'!AR50>0,'INVOER JUDOKA''S'!AR50,0)","v":0},{"$f":"IF('INVOER JUDOKA''S'!AS50>0,'INVOER JUDOKA''S'!AS50,0)","v":0},{"$f":"IF('INVOER JUDOKA''S'!AT50>0,'INVOER JUDOKA''S'!AT50,0)","v":0},{"$f":"IF('INVOER JUDOKA''S'!AU50>0,'INVOER JUDOKA''S'!AU50,0)","v":0},{"$f":"IF('INVOER JUDOKA''S'!AV50>0,'INVOER JUDOKA''S'!AV50,0)","v":0},{"$f":"IF('INVOER JUDOKA''S'!AW50>0,'INVOER JUDOKA''S'!AW50,0)","v":0},{"$f":"IF('INVOER JUDOKA''S'!AX50>0,'INVOER JUDOKA''S'!AX50,0)","v":0},{"$f":"IF('INVOER JUDOKA''S'!AY50>0,'INVOER JUDOKA''S'!AY50,0)","v":0},{"$f":"IF('INVOER JUDOKA''S'!AZ50>0,'INVOER JUDOKA''S'!AZ50,0)","v":0},{"$f":"IF('INVOER JUDOKA''S'!BA50>0,'INVOER JUDOKA''S'!BA50,0)","v":0},{"$f":"IF('INVOER JUDOKA''S'!BB50>0,'INVOER JUDOKA''S'!BB50,0)","v":0},{"$f":"IF('INVOER JUDOKA''S'!BC50>0,'INVOER JUDOKA''S'!BC50,0)","v":0},{"$f":"IF('INVOER JUDOKA''S'!BD50>0,'INVOER JUDOKA''S'!BD50,0)","v":0},{"$f":"IF('INVOER JUDOKA''S'!BE50>0,'INVOER JUDOKA''S'!BE50,0)","v":0},{"$f":"IF('INVOER JUDOKA''S'!BF50>0,'INVOER JUDOKA''S'!BF50,0)","v":0},{"$f":"IF('INVOER JUDOKA''S'!BG50>0,'INVOER JUDOKA''S'!BG50,0)","v":0},{"$f":"IF('INVOER JUDOKA''S'!BH50>0,'INVOER JUDOKA''S'!BH50,0)","v":0}]
[null,{"$f":"IF('INVOER JUDOKA''S'!AP51>0,'INVOER JUDOKA''S'!AP51,0)","v":0},{"$f":"IF('INVOER JUDOKA''S'!AQ51>0,'INVOER JUDOKA''S'!AQ51,0)","v":0},{"$f":"IF('INVOER JUDOKA''S'!AR51>0,'INVOER JUDOKA''S'!AR51,0)","v":0},{"$f":"IF('INVOER JUDOKA''S'!AS51>0,'INVOER JUDOKA''S'!AS51,0)","v":0},{"$f":"IF('INVOER JUDOKA''S'!AT51>0,'INVOER JUDOKA''S'!AT51,0)","v":0},{"$f":"IF('INVOER JUDOKA''S'!AU51>0,'INVOER JUDOKA''S'!AU51,0)","v":0},{"$f":"IF('INVOER JUDOKA''S'!AV51>0,'INVOER JUDOKA''S'!AV51,0)","v":0},{"$f":"IF('INVOER JUDOKA''S'!AW51>0,'INVOER JUDOKA''S'!AW51,0)","v":0},{"$f":"IF('INVOER JUDOKA''S'!AX51>0,'INVOER JUDOKA''S'!AX51,0)","v":0},{"$f":"IF('INVOER JUDOKA''S'!AY51>0,'INVOER JUDOKA''S'!AY51,0)","v":0},{"$f":"IF('INVOER JUDOKA''S'!AZ51>0,'INVOER JUDOKA''S'!AZ51,0)","v":0},{"$f":"IF('INVOER JUDOKA''S'!BA51>0,'INVOER JUDOKA''S'!BA51,0)","v":0},{"$f":"IF('INVOER JUDOKA''S'!BB51>0,'INVOER JUDOKA''S'!BB51,0)","v":0},{"$f":"IF('INVOER JUDOKA''S'!BC51>0,'INVOER JUDOKA''S'!BC51,0)","v":0},{"$f":"IF('INVOER JUDOKA''S'!BD51>0,'INVOER JUDOKA''S'!BD51,0)","v":0},{"$f":"IF('INVOER JUDOKA''S'!BE51>0,'INVOER JUDOKA''S'!BE51,0)","v":0},{"$f":"IF('INVOER JUDOKA''S'!BF51>0,'INVOER JUDOKA''S'!BF51,0)","v":0},{"$f":"IF('INVOER JUDOKA''S'!BG51>0,'INVOER JUDOKA''S'!BG51,0)","v":0},{"$f":"IF('INVOER JUDOKA''S'!BH51>0,'INVOER JUDOKA''S'!BH51,0)","v":0}]
[null,{"$f":"IF('INVOER JUDOKA''S'!AP52>0,'INVOER JUDOKA''S'!AP52,0)","v":0},{"$f":"IF('INVOER JUDOKA''S'!AQ52>0,'INVOER JUDOKA''S'!AQ52,0)","v":0},{"$f":"IF('INVOER JUDOKA''S'!AR52>0,'INVOER JUDOKA''S'!AR52,0)","v":0},{"$f":"IF('INVOER JUDOKA''S'!AS52>0,'INVOER JUDOKA''S'!AS52,0)","v":0},{"$f":"IF('INVOER JUDOKA''S'!AT52>0,'INVOER JUDOKA''S'!AT52,0)","v":0},{"$f":"IF('INVOER JUDOKA''S'!AU52>0,'INVOER JUDOKA''S'!AU52,0)","v":0},{"$f":"IF('INVOER JUDOKA''S'!AV52>0,'INVOER JUDOKA''S'!AV52,0)","v":0},{"$f":"IF('INVOER JUDOKA''S'!AW52>0,'INVOER JUDOKA''S'!AW52,0)","v":0},{"$f":"IF('INVOER JUDOKA''S'!AX52>0,'INVOER JUDOKA''S'!AX52,0)","v":0},{"$f":"IF('INVOER JUDOKA''S'!AY52>0,'INVOER JUDOKA''S'!AY52,0)","v":0},{"$f":"IF('INVOER JUDOKA''S'!AZ52>0,'INVOER JUDOKA''S'!AZ52,0)","v":0},{"$f":"IF('INVOER JUDOKA''S'!BA52>0,'INVOER JUDOKA''S'!BA52,0)","v":0},{"$f":"IF('INVOER JUDOKA''S'!BB52>0,'INVOER JUDOKA''S'!BB52,0)","v":0},{"$f":"IF('INVOER JUDOKA''S'!BC52>0,'INVOER JUDOKA''S'!BC52,0)","v":0},{"$f":"IF('INVOER JUDOKA''S'!BD52>0,'INVOER JUDOKA''S'!BD52,0)","v":0},{"$f":"IF('INVOER JUDOKA''S'!BE52>0,'INVOER JUDOKA''S'!BE52,0)","v":0},{"$f":"IF('INVOER JUDOKA''S'!BF52>0,'INVOER JUDOKA''S'!BF52,0)","v":0},{"$f":"IF('INVOER JUDOKA''S'!BG52>0,'INVOER JUDOKA''S'!BG52,0)","v":0},{"$f":"IF('INVOER JUDOKA''S'!BH52>0,'INVOER JUDOKA''S'!BH52,0)","v":0}]
[null,{"$f":"IF('INVOER JUDOKA''S'!AP53>0,'INVOER JUDOKA''S'!AP53,0)","v":0},{"$f":"IF('INVOER JUDOKA''S'!AQ53>0,'INVOER JUDOKA''S'!AQ53,0)","v":0},{"$f":"IF('INVOER JUDOKA''S'!AR53>0,'INVOER JUDOKA''S'!AR53,0)","v":0},{"$f":"IF('INVOER JUDOKA''S'!AS53>0,'INVOER JUDOKA''S'!AS53,0)","v":0},{"$f":"IF('INVOER JUDOKA''S'!AT53>0,'INVOER JUDOKA''S'!AT53,0)","v":0},{"$f":"IF('INVOER JUDOKA''S'!AU53>0,'INVOER JUDOKA''S'!AU53,0)","v":0},{"$f":"IF('INVOER JUDOKA''S'!AV53>0,'INVOER JUDOKA''S'!AV53,0)","v":0},{"$f":"IF('INVOER JUDOKA''S'!AW53>0,'INVOER JUDOKA''S'!AW53,0)","v":0},{"$f":"IF('INVOER JUDOKA''S'!AX53>0,'INVOER JUDOKA''S'!AX53,0)","v":0},{"$f":"IF('INVOER JUDOKA''S'!AY53>0,'INVOER JUDOKA''S'!AY53,0)","v":0},{"$f":"IF('INVOER JUDOKA''S'!AZ53>0,'INVOER JUDOKA''S'!AZ53,0)","v":0},{"$f":"IF('INVOER JUDOKA''S'!BA53>0,'INVOER JUDOKA''S'!BA53,0)","v":0},{"$f":"IF('INVOER JUDOKA''S'!BB53>0,'INVOER JUDOKA''S'!BB53,0)","v":0},{"$f":"IF('INVOER JUDOKA''S'!BC53>0,'INVOER JUDOKA''S'!BC53,0)","v":0},{"$f":"IF('INVOER JUDOKA''S'!BD53>0,'INVOER JUDOKA''S'!BD53,0)","v":0},{"$f":"IF('INVOER JUDOKA''S'!BE53>0,'INVOER JUDOKA''S'!BE53,0)","v":0},{"$f":"IF('INVOER JUDOKA''S'!BF53>0,'INVOER JUDOKA''S'!BF53,0)","v":0},{"$f":"IF('INVOER JUDOKA''S'!BG53>0,'INVOER JUDOKA''S'!BG53,0)","v":0},{"$f":"IF('INVOER JUDOKA''S'!BH53>0,'INVOER JUDOKA''S'!BH53,0)","v":0}]
[null,{"$f":"IF('INVOER JUDOKA''S'!AP54>0,'INVOER JUDOKA''S'!AP54,0)","v":0},{"$f":"IF('INVOER JUDOKA''S'!AQ54>0,'INVOER JUDOKA''S'!AQ54,0)","v":0},{"$f":"IF('INVOER JUDOKA''S'!AR54>0,'INVOER JUDOKA''S'!AR54,0)","v":0},{"$f":"IF('INVOER JUDOKA''S'!AS54>0,'INVOER JUDOKA''S'!AS54,0)","v":0},{"$f":"IF('INVOER JUDOKA''S'!AT54>0,'INVOER JUDOKA''S'!AT54,0)","v":0},{"$f":"IF('INVOER JUDOKA''S'!AU54>0,'INVOER JUDOKA''S'!AU54,0)","v":0},{"$f":"IF('INVOER JUDOKA''S'!AV54>0,'INVOER JUDOKA''S'!AV54,0)","v":0},{"$f":"IF('INVOER JUDOKA''S'!AW54>0,'INVOER JUDOKA''S'!AW54,0)","v":0},{"$f":"IF('INVOER JUDOKA''S'!AX54>0,'INVOER JUDOKA''S'!AX54,0)","v":0},{"$f":"IF('INVOER JUDOKA''S'!AY54>0,'INVOER JUDOKA''S'!AY54,0)","v":0},{"$f":"IF('INVOER JUDOKA''S'!AZ54>0,'INVOER JUDOKA''S'!AZ54,0)","v":0},{"$f":"IF('INVOER JUDOKA''S'!BA54>0,'INVOER JUDOKA''S'!BA54,0)","v":0},{"$f":"IF('INVOER JUDOKA''S'!BB54>0,'INVOER JUDOKA''S'!BB54,0)","v":0},{"$f":"IF('INVOER JUDOKA''S'!BC54>0,'INVOER JUDOKA''S'!BC54,0)","v":0},{"$f":"IF('INVOER JUDOKA''S'!BD54>0,'INVOER JUDOKA''S'!BD54,0)","v":0},{"$f":"IF('INVOER JUDOKA''S'!BE54>0,'INVOER JUDOKA''S'!BE54,0)","v":0},{"$f":"IF('INVOER JUDOKA''S'!BF54>0,'INVOER JUDOKA''S'!BF54,0)","v":0},{"$f":"IF('INVOER JUDOKA''S'!BG54>0,'INVOER JUDOKA''S'!BG54,0)","v":0},{"$f":"IF('INVOER JUDOKA''S'!BH54>0,'INVOER JUDOKA''S'!BH54,0)","v":0}]
[null,{"$f":"IF('INVOER JUDOKA''S'!AP55>0,'INVOER JUDOKA''S'!AP55,0)","v":0},{"$f":"IF('INVOER JUDOKA''S'!AQ55>0,'INVOER JUDOKA''S'!AQ55,0)","v":0},{"$f":"IF('INVOER JUDOKA''S'!AR55>0,'INVOER JUDOKA''S'!AR55,0)","v":0},{"$f":"IF('INVOER JUDOKA''S'!AS55>0,'INVOER JUDOKA''S'!AS55,0)","v":0},{"$f":"IF('INVOER JUDOKA''S'!AT55>0,'INVOER JUDOKA''S'!AT55,0)","v":0},{"$f":"IF('INVOER JUDOKA''S'!AU55>0,'INVOER JUDOKA''S'!AU55,0)","v":0},{"$f":"IF('INVOER JUDOKA''S'!AV55>0,'INVOER JUDOKA''S'!AV55,0)","v":0},{"$f":"IF('INVOER JUDOKA''S'!AW55>0,'INVOER JUDOKA''S'!AW55,0)","v":0},{"$f":"IF('INVOER JUDOKA''S'!AX55>0,'INVOER JUDOKA''S'!AX55,0)","v":0},{"$f":"IF('INVOER JUDOKA''S'!AY55>0,'INVOER JUDOKA''S'!AY55,0)","v":0},{"$f":"IF('INVOER JUDOKA''S'!AZ55>0,'INVOER JUDOKA''S'!AZ55,0)","v":0},{"$f":"IF('INVOER JUDOKA''S'!BA55>0,'INVOER JUDOKA''S'!BA55,0)","v":0},{"$f":"IF('INVOER JUDOKA''S'!BB55>0,'INVOER JUDOKA''S'!BB55,0)","v":0},{"$f":"IF('INVOER JUDOKA''S'!BC55>0,'INVOER JUDOKA''S'!BC55,0)","v":0},{"$f":"IF('INVOER JUDOKA''S'!BD55>0,'INVOER JUDOKA''S'!BD55,0)","v":0},{"$f":"IF('INVOER JUDOKA''S'!BE55>0,'INVOER JUDOKA''S'!BE55,0)","v":0},{"$f":"IF('INVOER JUDOKA''S'!BF55>0,'INVOER JUDOKA''S'!BF55,0)","v":0},{"$f":"IF('INVOER JUDOKA''S'!BG55>0,'INVOER JUDOKA''S'!BG55,0)","v":0},{"$f":"IF('INVOER JUDOKA''S'!BH55>0,'INVOER JUDOKA''S'!BH55,0)","v":0}]

{"sheet":"ALLE POULE'S","index":4,"n_rows":28,"n_cols":21,"rows_kept":28,"cut":false,"hidden":false,"merged":[[17,1,17,2],[16,16,16,17],[0,1,0,20],[17,4,17,5],[17,7,17,8],[17,10,17,11],[17,13,17,14],[17,16,17,17],[17,19,17,20],[16,13,16,14],[2,19,2,20],[16,7,16,8],[16,19,16,20],[2,1,2,2],[2,4,2,5],[2,10,2,11],[16,10,16,11],[15,1,15,20],[16,4,16,5],[16,1,16,2],[1,1,1,20],[3,1,3,2],[3,4,3,5],[3,7,3,8],[3,10,3,11],[3,13,3,14],[3,16,3,17],[3,19,3,20],[2,7,2,8],[2,13,2,14],[2,16,2,17]]}
[null,"Categorie/Poule Indeling Stichting Topjudo Almere 2023"]
[null,"Jongens/Heren"]
[null,"-8 jaar",null,null,"-10 jaar",null,null,"-12 jaar",null,null,"-15 jaar",null,null,"-18 jaar",null,null,"-21 jaar",null,null,"+21 jaar"]
[null,"Geboortejaar:2016-2017",null,null,"Geboortejaar:2014-2015",null,null,"Geboortejaar:2012-2013",null,null,"Geboortejaar:2009-2010-2011",null,null,"Geboortejaar:2006-2007-2008",null,null,"Geboortejaar:2003-2004-2005",null,null,"Geboortejaar:2002 en ouder"]
[null,"Categorie","Poule",null,"Categorie","Poule",null,"Categorie","Poule",null,"Categorie","Poule",null,"Categorie","Poule",null,"Categorie","Poule",null,"Categorie","Poule"]
[null,"JONGENS/-8 JAAR/ -18 KG.",101,null,"JONGENS/-10 JAAR/ -21 KG.",109,null,"JONGENS/-12 JAAR/ -24 KG.",117,null,"JONGENS/-15 JAAR/ -34 KG.",126,null,"JONGENS/-18 JAAR/ -46 KG.",135,null,"HEREN/-21 JAAR/ -55 KG.",144,null,"HEREN/+21 JAAR/ -60 KG.",152]
[null,"JONGENS/-8 JAAR/ -21 KG.",102,null,"JONGENS/-10 JAAR/ -24 KG.",110,null,"JONGENS/-12 JAAR/ -27 KG.",118,null,"JONGENS/-15 JAAR/ -38 KG.",127,null,"JONGENS/-18 JAAR/ -50 KG.",136,null,"HEREN/-21 JAAR/ -60 KG.",145,null,"HEREN/+21 JAAR/ -66 KG.",153]
[null,"JONGENS/-8 JAAR/ -24 KG.",103,null,"JONGENS/-10 JAAR/ -27 KG.",111,null,"JONGENS/-12 JAAR/ -30 KG.",119,null,"JONGENS/-15 JAAR/ -42 KG.",128,null,"JONGENS/-18 JAAR/ -55 KG.",137,null,"HEREN/-21 JAAR/ -66 KG.",146,null,"HEREN/+21 JAAR/ -73 KG.",154]
[null,"JONGENS/-8 JAAR/ -27 KG.",104,null,"JONGENS/-10 JAAR/ -30 KG.",112,null,"JONGENS/-12 JAAR/ -34 KG.",120,null,"JONGENS/-15 JAAR/ -46 KG.",129,null,"JONGENS/-18 JAAR/ -60 KG.",138,null,"HEREN/-21 JAAR/ -73 KG.",147,null,"HEREN/+21 JAAR/ -81 KG.",155]
[null,"JONGENS/-8 JAAR/ -30 KG.",105,null,"JONGENS/-10 JAAR/ -34 KG.",113,null,"JONGENS/-12 JAAR/ -38 KG.",121,null,"JONGENS/-15 JAAR/ -50 KG.",130,null,"JONGENS/-18 JAAR/ -66 KG.",139,null,"HEREN/-21 JAAR/ -81 KG.",148,null,"HEREN/+21 JAAR/ -90 KG.",156]
[null,"JONGENS/-8 JAAR/ -34 KG.",106,null,"JONGENS/-10 JAAR/ -38 KG.",114,null,"JONGENS/-12 JAAR/ -42 KG.",122,null,"JONGENS/-15 JAAR/ -55 KG.",131,null,"JONGENS/-18 JAAR/ -73 KG.",140,null,"HEREN/-21 JAAR/ -90 KG.",149,null,"HEREN/+21 JAAR/ -100 KG.",157]
[null,"JONGENS/-8 JAAR/ -38 KG.",107,null,"JONGENS/-10 JAAR/ -42 KG.",115,null,"JONGENS/-12 JAAR/ -46 KG.",123,null,"JONGENS/-15 JAAR/ -60 KG.",132,null,"JONGENS/-18 JAAR/ -81 KG.",141,null,"HEREN/-21 JAAR/ -100 KG.",150,null,"HEREN/+21 JAAR/ +100 KG.",158]
[null,"JONGENS/-8 JAAR/ +38 KG.",108,null,"JONGENS/-10 JAAR/ +42 KG.",116,null,"JONGENS/-12 JAAR/ -50 KG.",124,null,"JONGENS/-15 JAAR/ -66 KG.",133,null,"JONGENS/-18 JAAR/ -90 KG.",142,null,"HEREN/-21 JAAR/ +100 KG.",151]
[null,null,null,null,null,null,null,"JONGENS/-12 JAAR/ +50 KG.",125,null,"JONGENS/-15 JAAR/ +66 KG.",134,null,"JONGENS/-18 JAAR/ +90 KG.",143]
[]
[null,"Meisjes/Dames"]
[null,"-8 jaar",null,null,"-10 jaar",null,null,"-12 jaar",null,null,"-15 jaar",null,null,"-18 jaar",null,null,"-21 jaar",null,null,"+21 jaar"]
[null,"Geboortejaar:2016-2017",null,null,"Geboortejaar:2014-2015",null,null,"Geboortejaar:2012-2013",null,null,"Geboortejaar:2009-2010-2011",null,null,"Geboortejaar:2006-2007-2008",null,null,"Geboortejaar:2003-2004-2005",null,null,"Geboortejaar:2002 en ouder"]
[null,"Categorie","Poule",null,"Categorie","Poule",null,"Categorie","Poule",null,"Categorie","Poule",null,"Categorie","Poule",null,"Categorie","Poule",null,"Categorie","Poule"]
[null,"MEISJES/-8 JAAR/ -18 KG.",201,null,"MEISJES/-10 JAAR/ -20 KG.",209,null,"MEISJES/-12 JAAR/ -22 KG.",217,null,"MEISJES/-15 JAAR/ -32 KG.",226,null,"MEISJES/-18 JAAR/-40 KG.",235,null,"DAMES/-21 JAAR/ -44 KG.",243,null,"DAMES/+21 JAAR/ -48 KG.",251]
[null,"MEISJES/-8 JAAR/ -20 KG.",202,null,"MEISJES/-10 JAAR/ -22 KG.",210,null,"MEISJES/-12 JAAR/ -25KG.",218,null,"MEISJES/-15 JAAR/ -36 KG.",227,null,"MEISJES/-18 JAAR/-44 KG.",236,null,"DAMES/-21 JAAR/ -48 KG.",244,null,"DAMES/+21 JAAR/ -52 KG.",252]
[null,"MEISJES/-8 JAAR/ -22 KG.",203,null,"MEISJES/-10 JAAR/ -25 KG.",211,null,"MEISJES/-12 JAAR/ -28 KG.",219,null,"MEISJES/-15 JAAR/ -40 KG.",228,null,"MEISJES/-18 JAAR/-48 KG.",237,null,"DAMES/-21 JAAR/ -52 KG.",245,null,"DAMES/+21 JAAR/ -57 KG.",253]
[null,"MEISJES/-8 JAAR/ -25 KG.",204,null,"MEISJES/-10 JAAR/ -28 KG.",212,null,"MEISJES/-12 JAAR/ -32 KG.",220,null,"MEISJES/-15 JAAR/ -44 KG.",229,null,"MEISJES/-18 JAAR/-52 KG.",238,null,"DAMES/-21 JAAR/ -57 KG.",246,null,"DAMES/+21 JAAR/ -63 KG.",254]
[null,"MEISJES/-8 JAAR/ -28 KG.",205,null,"MEISJES/-10 JAAR/ -32 KG.",213,null,"MEISJES/-12 JAAR/ -36 KG.",221,null,"MEISJES/-15 JAAR/ -48 KG.",230,null,"MEISJES/-18 JAAR/-57 KG.",239,null,"DAMES/-21 JAAR/ -63 KG.",247,null,"DAMES/+21 JAAR/ -70 KG.",255]
[null,"MEISJES/-8 JAAR/ -32 KG.",206,null,"MEISJES/-10 JAAR/ -36 KG.",214,null,"MEISJES/-12 JAAR/ -40 KG.",222,null,"MEISJES/-15 JAAR/ -52 KG.",231,null,"MEISJES/-18 JAAR/-63 KG.",240,null,"DAMES/-21 JAAR/ -70 KG.",248,null,"DAMES/+21 JAAR/ -78 KG.",256]
[null,"MEISJES/-8 JAAR/ -36 KG.",207,null,"MEISJES/-10 JAAR/ -40 KG.",215,null,"MEISJES/-12 JAAR/ -44 KG.",223,null,"MEISJES/-15 JAAR/ -57 KG.",232,null,"MEISJES/-18 JAAR/-70 KG.",241,null,"DAMES/-21 JAAR/ -78 KG.",249,null,"DAMES/+21 JAAR/ +78 KG.",257]
[null,"MEISJES/-8 JAAR/+36 KG.",208,null,"MEISJES/-10 JAAR/+40 KG.",216,null,"MEISJES/-12 JAAR/ -48 KG.",224,null,"MEISJES/-15 JAAR/ -63 KG.",233,null,"MEISJES/-18 JAAR/+70 KG.",242,null,"DAMES/-21 JAAR/ +78 KG.",250]
[null,null,null,null,null,null,null,"MEISJES/-12 JAAR/ +48 KG.",225,null,"MEISJES/-15 JAAR/ +63 KG.",234]

{"sheet":"GEGEVENS-2023","index":5,"n_rows":118,"n_cols":53,"rows_kept":118,"cut":false,"hidden":false,"merged":[[1,50,1,52]]}
[]
[null,null,null,null,null,null,null,null,null,null,null,null,null,null,null,null,null,null,null,null,null,null,null,null,null,null,null,null,null,null,1,2,3,4,5,6,7,8,9,10,11,12,13,14,15,null,null,null,null,null,"Poule bij categorie zoeken"]
[null,null,null,null,null,null,null,null,null,null,null,null,null,null,null,null,null,null,null,null,"DAG","maand","code","JAAR",null,null,null,null,null,null,"CODE","Jaar","code+jaar","GESLACHT","GESLACHT","LEEFTIJDSCATEGORIE",1,2,3,4,5,6,7,8,9,null,"GESLACHT","LEEFTIJD","GEWICHT","CATEGORIE","POULE","Aantal poule's","CATEGORIE CONTROLE MET INSCHRIJFFORMULIER"]
[null,null,null,null,null,null,null,null,null,null,null,null,null,null,null,null,null,null,null,null,1,"JANUARI",1,2017,null,null,null,null,null,null,1,2017,"2-2017","MEISJE","MEISJES","-8 JAAR"," -18 KG."," -20 KG."," -22 KG."," -25 KG."," -28 KG."," -32 KG."," -36 KG.","+36 KG.",null,null,"JONGENS","-8 JAAR"," -18 KG.","JONGENS/-8 JAAR/ -18 KG.",101,1,"JONGENS/-8 JAAR/ -18 KG."]
[null,null,null,null,null,null,null,null,null,null,null,null,null,null,null,null,null,null,null,null,2,"FEBRUARI",2,2016,null,null,null,null,null,null,2,2016,"2-2016","MEISJE","MEISJES","-8 JAAR"," -18 KG."," -20 KG."," -22 KG."," -25 KG."," -28 KG."," -32 KG."," -36 KG.","+36 KG.",null,null,"JONGENS","-8 JAAR"," -21 KG.","JONGENS/-8 JAAR/ -21 KG.",102,2,"JONGENS/-8 JAAR/ -21 KG."]
[null,null,null,null,null,null,null,null,null,null,null,null,null,null,null,null,null,null,null,null,3,"MAART",3,2015,null,null,null,null,null,null,3,2015,"2-2015","MEISJE","MEISJES","-10 JAAR"," -20 KG."," -22 KG."," -25 KG."," -28 KG."," -32 KG."," -36 KG."," -40 KG.","+40 KG.",null,null,"JONGENS","-8 JAAR"," -24 KG.","JONGENS/-8 JAAR/ -24 KG.",103,3,"JONGENS/-8 JAAR/ -24 KG."]
[null,null,null,null,null,null,null,null,null,null,null,null,null,null,null,null,null,null,null,null,4,"APRIL",4,2014,null,null,null,null,null,null,4,2014,"2-2014","MEISJE","MEISJES","-10 JAAR"," -20 KG."," -22 KG."," -25 KG."," -28 KG."," -32 KG."," -36 KG."," -40 KG.","+40 KG.",null,null,"JONGENS","-8 JAAR"," -27 KG.","JONGENS/-8 JAAR/ -27 KG.",104,4,"JONGENS/-8 JAAR/ -27 KG."]
[null,null,null,null,null,null,null,null,null,null,null,null,null,null,null,null,null,null,null,null,5,"MEI",5,2013,null,null,null,null,null,null,5,2013,"2-2013","MEISJE","MEISJES","-12 JAAR"," -22 KG."," -25KG."," -28 KG."," -32 KG."," -36 KG."," -40 KG."," -44 KG."," -48 KG."," +48 KG.",null,"JONGENS","-8 JAAR"," -30 KG.","JONGENS/-8 JAAR/ -30 KG.",105,5,"JONGENS/-8 JAAR/ -30 KG."]
[null,null,null,null,null,null,null,null,null,null,null,null,null,null,null,null,null,null,null,null,6,"JUNI",6,2012,null,null,null,null,null,null,6,2012,"2-2012","MEISJE","MEISJES","-12 JAAR"," -22 KG."," -25KG."," -28 KG."," -32 KG."," -36 KG."," -40 KG."," -44 KG."," -48 KG."," +48 KG.",null,"JONGENS","-8 JAAR"," -34 KG.","JONGENS/-8 JAAR/ -34 KG.",106,6,"JONGENS/-8 JAAR/ -34 KG."]
[null,null,null,null,null,null,null,null,null,null,null,null,null,null,null,null,null,null,null,null,7,"JULI",7,2011,null,null,null,null,null,null,7,2011,"2-2011","MEISJE","MEISJES","-15 JAAR"," -32 KG."," -36 KG."," -40 KG."," -44 KG."," -48 KG."," -52 KG."," -57 KG."," -63 KG."," +63 KG.",null,"JONGENS","-8 JAAR"," -38 KG.","JONGENS/-8 JAAR/ -38 KG.",107,7,"JONGENS/-8 JAAR/ -38 KG."]
[null,null,null,null,null,null,null,null,null,null,null,null,null,null,null,null,null,null,null,null,8,"AUGUSTUS",8,2010,null,null,null,null,null,null,8,2010,"2-2010","MEISJE","MEISJES","-15 JAAR"," -32 KG."," -36 KG."," -40 KG."," -44 KG."," -48 KG."," -52 KG."," -57 KG."," -63 KG."," +63 KG.",null,"JONGENS","-8 JAAR"," +38 KG.","JONGENS/-8 JAAR/ +38 KG.",108,8,"JONGENS/-8 JAAR/+38 KG."]
[null,null,null,null,null,null,{"$f":"Blad4!F2","v":0},{"$f":"Blad4!G2","v":0},{"$f":"Blad4!H8","v":0},{"$f":"Blad4!I8","v":0},{"$f":"Blad4!J8","v":0},{"$f":"Blad4!K8","v":0},{"$f":"Blad4!L8","v":0},{"$f":"Blad4!M8","v":0},{"$f":"Blad4!N8","v":0},{"$f":"Blad4!O8","v":0},{"$f":"Blad4!P8","v":0},{"$f":"Blad4!Q8","v":0},{"$f":"Blad4!R8","v":0},null,9,"SEPTEMBER",9,2009,null,null,null,null,null,null,9,2009,"2-2009","MEISJE","MEISJES","-15 JAAR"," -32 KG."," -36 KG."," -40 KG."," -44 KG."," -48 KG."," -52 KG."," -57 KG."," -63 KG."," +63 KG.",null,"JONGENS","-10 JAAR"," -21 KG.","JONGENS/-10 JAAR/ -21 KG.",109,9,"JONGENS/-10 JAAR/ -21 KG."]
[null,null,null,null,null,null,{"$f":"Blad4!F3","v":0},{"$f":"Blad4!G3","v":0},{"$f":"Blad4!H9","v":0},{"$f":"Blad4!I9","v":0},{"$f":"Blad4!J9","v":0},{"$f":"Blad4!K9","v":0},{"$f":"Blad4!L9","v":0},{"$f":"Blad4!M9","v":0},{"$f":"Blad4!N9","v":0},{"$f":"Blad4!O9","v":0},{"$f":"Blad4!P9","v":0},{"$f":"Blad4!Q9","v":0},{"$f":"Blad4!R9","v":0},null,10,"OKTOBER",10,2008,null,null,null,null,null,null,10,2008,"2-2008","MEISJE","MEISJES","-18 JAAR","-40 KG.","-44 KG.","-48 KG.","-52 KG.","-57 KG.","-63 KG.","-70 KG.","+70 KG.",null,null,"JONGENS","-10 JAAR"," -24 KG.","JONGENS/-10 JAAR/ -24 KG.",110,10,"JONGENS/-10 JAAR/ -24 KG."]
[null,null,null,null,null,null,{"$f":"Blad4!F4","v":0},{"$f":"Blad4!G4","v":0},{"$f":"Blad4!H10","v":0},{"$f":"Blad4!I10","v":0},{"$f":"Blad4!J10","v":0},{"$f":"Blad4!K10","v":0},{"$f":"Blad4!L10","v":0},{"$f":"Blad4!M10","v":0},{"$f":"Blad4!N10","v":0},{"$f":"Blad4!O10","v":0},{"$f":"Blad4!P10","v":0},{"$f":"Blad4!Q10","v":0},{"$f":"Blad4!R10","v":0},null,11,"NOVEMBER",11,2007,null,null,null,null,null,null,11,2007,"2-2007","MEISJE","MEISJES","-18 JAAR","-40 KG.","-44 KG.","-48 KG.","-52 KG.","-57 KG.","-63 KG.","-70 KG.","+70 KG.",null,null,"JONGENS","-10 JAAR"," -27 KG.","JONGENS/-10 JAAR/ -27 KG.",111,11,"JONGENS/-10 JAAR/ -27 KG."]
[null,null,null,null,null,null,{"$f":"Blad4!F5","v":0},{"$f":"Blad4!G5","v":0},{"$f":"Blad4!H11","v":0},{"$f":"Blad4!I11","v":0},{"$f":"Blad4!J11","v":0},{"$f":"Blad4!K11","v":0},{"$f":"Blad4!L11","v":0},{"$f":"Blad4!M11","v":0},{"$f":"Blad4!N11","v":0},{"$f":"Blad4!O11","v":0},{"$f":"Blad4!P11","v":0},{"$f":"Blad4!Q11","v":0},{"$f":"Blad4!R11","v":0},null,12,"DECEMBER",12,2006,null,null,null,null,null,null,12,2006,"2-2006","MEISJE","MEISJES","-18 JAAR","-40 KG.","-44 KG.","-48 KG.","-52 KG.","-57 KG.","-63 KG.","-70 KG.","+70 KG.",null,null,"JONGENS","-10 JAAR"," -30 KG.","JONGENS/-10 JAAR/ -30 KG.",112,12,"JONGENS/-10 JAAR/ -30 KG."]
[null,"GESLACHT",null,null,null,null,{"$f":"Blad4!F6","v":0},{"$f":"Blad4!G6","v":0},{"$f":"Blad4!H12","v":0},{"$f":"Blad4!I12","v":0},{"$f":"Blad4!J12","v":0},{"$f":"Blad4!K12","v":0},{"$f":"Blad4!L12","v":0},{"$f":"Blad4!M12","v":0},{"$f":"Blad4!N12","v":0},{"$f":"Blad4!O12","v":0},{"$f":"Blad4!P12","v":0},{"$f":"Blad4!Q12","v":0},{"$f":"Blad4!R12","v":0},null,13,"MAAND",13,2005,null,null,null,null,null,null,13,2005,"2-2005","VROUW","DAMES","-21 JAAR"," -44 KG."," -48 KG."," -52 KG."," -57 KG."," -63 KG."," -70 KG."," -78 KG."," +78 KG.",null,null,"JONGENS","-10 JAAR"," -34 KG.","JONGENS/-10 JAAR/ -34 KG.",113,13,"JONGENS/-10 JAAR/ -34 KG."]
[1,"MAN",null,"GRADUATIE",null,null,{"$f":"Blad4!F7","v":0},{"$f":"Blad4!G7","v":0},{"$f":"Blad4!H13","v":0},{"$f":"Blad4!I13","v":0},{"$f":"Blad4!J13","v":0},{"$f":"Blad4!K13","v":0},{"$f":"Blad4!L13","v":0},{"$f":"Blad4!M13","v":0},{"$f":"Blad4!N13","v":0},{"$f":"Blad4!O13","v":0},{"$f":"Blad4!P13","v":0},{"$f":"Blad4!Q13","v":0},{"$f":"Blad4!R13","v":0},null,14,null,14,2004,null,null,null,null,null,null,14,2004,"2-2004","VROUW","DAMES","-21 JAAR"," -44 KG."," -48 KG."," -52 KG."," -57 KG."," -63 KG."," -70 KG."," -78 KG."," +78 KG.",null,null,"JONGENS","-10 JAAR"," -38 KG.","JONGENS/-10 JAAR/ -38 KG.",114,14,"JONGENS/-10 JAAR/ -38 KG."]
[2,"VROUW",1,"6E KYU (WIT)",null,null,{"$f":"Blad4!F8","v":0},{"$f":"Blad4!G8","v":0},{"$f":"Blad4!H14","v":0},{"$f":"Blad4!I14","v":0},{"$f":"Blad4!J14","v":0},{"$f":"Blad4!K14","v":0},{"$f":"Blad4!L14","v":0},{"$f":"Blad4!M14","v":0},{"$f":"Blad4!N14","v":0},{"$f":"Blad4!O14","v":0},{"$f":"Blad4!P14","v":0},{"$f":"Blad4!Q14","v":0},{"$f":"Blad4!R14","v":0},null,15,null,15,2003,null,null,null,null,null,null,15,2003,"2-2003","VROUW","DAMES","-21 JAAR"," -44 KG."," -48 KG."," -52 KG."," -57 KG."," -63 KG."," -70 KG."," -78 KG."," +78 KG.",null,null,"JONGENS","-10 JAAR"," -42 KG.","JONGENS/-10 JAAR/ -42 KG.",115,15,"JONGENS/-10 JAAR/ -42 KG."]
[null,null,2,"5E KYU (GEEL)",null,null,{"$f":"Blad4!F9","v":0},{"$f":"Blad4!G9","v":0},{"$f":"Blad4!H15","v":0},{"$f":"Blad4!I15","v":0},{"$f":"Blad4!J15","v":0},{"$f":"Blad4!K15","v":0},{"$f":"Blad4!L15","v":0},{"$f":"Blad4!M15","v":0},{"$f":"Blad4!N15","v":0},{"$f":"Blad4!O15","v":0},{"$f":"Blad4!P15","v":0},{"$f":"Blad4!Q15","v":0},{"$f":"Blad4!R15","v":0},null,16,null,16,2002,null,null,null,null,null,null,16,2002,"2-2002","VROUW","DAMES","+21 JAAR"," -48 KG."," -52 KG."," -57 KG."," -63 KG."," -70 KG."," -78 KG."," +78 KG.",null,null,null,"JONGENS","-10 JAAR"," +42 KG.","JONGENS/-10 JAAR/ +42 KG.",116,16,"JONGENS/-10 JAAR/ +42 KG."]
[null,null,3,"4E KYU (ORANJE)",null,null,{"$f":"Blad4!F10","v":0},{"$f":"Blad4!G10","v":0},{"$f":"Blad4!H16","v":0},{"$f":"Blad4!I16","v":0},{"$f":"Blad4!J16","v":0},{"$f":"Blad4!K16","v":0},{"$f":"Blad4!L16","v":0},{"$f":"Blad4!M16","v":0},{"$f":"Blad4!N16","v":0},{"$f":"Blad4!O16","v":0},{"$f":"Blad4!P16","v":0},{"$f":"Blad4!Q16","v":0},{"$f":"Blad4!R16","v":0},null,17,null,17,2001,null,null,null,null,null,null,17,2001,"2-2001","VROUW","DAMES","+21 JAAR"," -48 KG."," -52 KG."," -57 KG."," -63 KG."," -70 KG."," -78 KG."," +78 KG.",null,null,null,"JONGENS","-12 JAAR"," -24 KG.","JONGENS/-12 JAAR/ -24 KG.",117,17,"JONGENS/-12 JAAR/ -24 KG."]
[null,null,4,"3E KYU (GROEN)",null,null,{"$f":"Blad4!F11","v":0},{"$f":"Blad4!G11","v":0},{"$f":"Blad4!H17","v":0},{"$f":"Blad4!I17","v":0},{"$f":"Blad4!J17","v":0},{"$f":"Blad4!K17","v":0},{"$f":"Blad4!L17","v":0},{"$f":"Blad4!M17","v":0},{"$f":"Blad4!N17","v":0},{"$f":"Blad4!O17","v":0},{"$f":"Blad4!P17","v":0},{"$f":"Blad4!Q17","v":0},{"$f":"Blad4!R17","v":0},null,18,null,18,2000,null,null,null,null,null,null,18,2000,"2-2000","VROUW","DAMES","+21 JAAR"," -48 KG."," -52 KG."," -57 KG."," -63 KG."," -70 KG."," -78 KG."," +78 KG.",null,null,null,"JONGENS","-12 JAAR"," -27 KG.","JONGENS/-12 JAAR/ -27 KG.",118,18,"JONGENS/-12 JAAR/ -27 KG."]
[null,null,5,"2E KYU (BLAUW",null,null,{"$f":"Blad4!F12","v":0},{"$f":"Blad4!G12","v":0},{"$f":"Blad4!H18","v":0},{"$f":"Blad4!I18","v":0},{"$f":"Blad4!J18","v":0},{"$f":"Blad4!K18","v":0},{"$f":"Blad4!L18","v":0},{"$f":"Blad4!M18","v":0},{"$f":"Blad4!N18","v":0},{"$f":"Blad4!O18","v":0},{"$f":"Blad4!P18","v":0},{"$f":"Blad4!Q18","v":0},{"$f":"Blad4!R18","v":0},null,19,null,19,1999,null,null,null,null,null,null,19,1999,"2-1999","VROUW","DAMES","+21 JAAR"," -48 KG."," -52 KG."," -57 KG."," -63 KG."," -70 KG."," -78 KG."," +78 KG.",null,null,null,"JONGENS","-12 JAAR"," -30 KG.","JONGENS/-12 JAAR/ -30 KG.",119,19,"JONGENS/-12 JAAR/ -30 KG."]
[null,null,6,"1E KYU (BRUIN)",null,null,{"$f":"Blad4!F13","v":0},{"$f":"Blad4!G13","v":0},{"$f":"Blad4!H19","v":0},{"$f":"Blad4!I19","v":0},{"$f":"Blad4!J19","v":0},{"$f":"Blad4!K19","v":0},{"$f":"Blad4!L19","v":0},{"$f":"Blad4!M19","v":0},{"$f":"Blad4!N19","v":0},{"$f":"Blad4!O19","v":0},{"$f":"Blad4!P19","v":0},{"$f":"Blad4!Q19","v":0},{"$f":"Blad4!R19","v":0},null,20,null,20,1998,null,null,null,null,null,null,20,1998,"2-1998","VROUW","DAMES","+21 JAAR"," -48 KG."," -52 KG."," -57 KG."," -63 KG."," -70 KG."," -78 KG."," +78 KG.",null,null,null,"JONGENS","-12 JAAR"," -34 KG.","JONGENS/-12 JAAR/ -34 KG.",120,20,"JONGENS/-12 JAAR/ -34 KG."]
[null,null,7,"1E DAN (ZWART)",null,null,{"$f":"Blad4!F14","v":0},{"$f":"Blad4!G14","v":0},{"$f":"Blad4!H20","v":0},{"$f":"Blad4!I20","v":0},{"$f":"Blad4!J20","v":0},{"$f":"Blad4!K20","v":0},{"$f":"Blad4!L20","v":0},{"$f":"Blad4!M20","v":0},{"$f":"Blad4!N20","v":0},{"$f":"Blad4!O20","v":0},{"$f":"Blad4!P20","v":0},{"$f":"Blad4!Q20","v":0},{"$f":"Blad4!R20","v":0},null,21,null,21,1997,null,null,null,null,null,null,21,1997,"2-1997","VROUW","DAMES","+21 JAAR"," -48 KG."," -52 KG."," -57 KG."," -63 KG."," -70 KG."," -78 KG."," +78 KG.",null,null,null,"JONGENS","-12 JAAR"," -38 KG.","JONGENS/-12 JAAR/ -38 KG.",121,21,"JONGENS/-12 JAAR/ -38 KG."]
[null,null,8,"2E DAN (ZWART)",null,null,{"$f":"Blad4!F15","v":0},{"$f":"Blad4!G15","v":0},{"$f":"Blad4!H21","v":0},{"$f":"Blad4!I21","v":0},{"$f":"Blad4!J21","v":0},{"$f":"Blad4!K21","v":0},{"$f":"Blad4!L21","v":0},{"$f":"Blad4!M21","v":0},{"$f":"Blad4!N21","v":0},{"$f":"Blad4!O21","v":0},{"$f":"Blad4!P21","v":0},{"$f":"Blad4!Q21","v":0},{"$f":"Blad4!R21","v":0},null,22,null,22,1996,null,null,null,null,null,null,22,1996,"2-1996","VROUW","DAMES","+21 JAAR"," -48 KG."," -52 KG."," -57 KG."," -63 KG."," -70 KG."," -78 KG."," +78 KG.",null,null,null,"JONGENS","-12 JAAR"," -42 KG.","JONGENS/-12 JAAR/ -42 KG.",122,22,"JONGENS/-12 JAAR/ -42 KG."]
[null,null,9,"3E DAN (ZWART)",null,null,{"$f":"Blad4!F16","v":0},{"$f":"Blad4!G16","v":0},{"$f":"Blad4!H22","v":0},{"$f":"Blad4!I22","v":0},{"$f":"Blad4!J22","v":0},{"$f":"Blad4!K22","v":0},{"$f":"Blad4!L22","v":0},{"$f":"Blad4!M22","v":0},{"$f":"Blad4!N22","v":0},{"$f":"Blad4!O22","v":0},{"$f":"Blad4!P22","v":0},{"$f":"Blad4!Q22","v":0},{"$f":"Blad4!R22","v":0},null,23,null,23,1995,null,null,null,null,null,null,23,1995,"2-1995","VROUW","DAMES","+21 JAAR"," -48 KG."," -52 KG."," -57 KG."," -63 KG."," -70 KG."," -78 KG."," +78 KG.",null,null,null,"JONGENS","-12 JAAR"," -46 KG.","JONGENS/-12 JAAR/ -46 KG.",123,23,"JONGENS/-12 JAAR/ -46 KG."]
[null,null,10,"4e DAN (ZWART)",null,null,{"$f":"Blad4!F17","v":0},{"$f":"Blad4!G17","v":0},{"$f":"Blad4!H23","v":0},{"$f":"Blad4!I23","v":0},{"$f":"Blad4!J23","v":0},{"$f":"Blad4!K23","v":0},{"$f":"Blad4!L23","v":0},{"$f":"Blad4!M23","v":0},{"$f":"Blad4!N23","v":0},{"$f":"Blad4!O23","v":0},{"$f":"Blad4!P23","v":0},{"$f":"Blad4!Q23","v":0},{"$f":"Blad4!R23","v":0},null,24,null,24,1994,null,null,null,null,null,null,24,1994,"2-1994","VROUW","DAMES","+21 JAAR"," -48 KG."," -52 KG."," -57 KG."," -63 KG."," -70 KG."," -78 KG."," +78 KG.",null,null,null,"JONGENS","-12 JAAR"," -50 KG.","JONGENS/-12 JAAR/ -50 KG.",124,24,"JONGENS/-12 JAAR/ -50 KG."]
[null,null,11,"5e DAN (ZWART)",null,null,{"$f":"Blad4!F18","v":0},{"$f":"Blad4!G18","v":0},{"$f":"Blad4!H24","v":0},{"$f":"Blad4!I24","v":0},{"$f":"Blad4!J24","v":0},{"$f":"Blad4!K24","v":0},{"$f":"Blad4!L24","v":0},{"$f":"Blad4!M24","v":0},{"$f":"Blad4!N24","v":0},{"$f":"Blad4!O24","v":0},{"$f":"Blad4!P24","v":0},{"$f":"Blad4!Q24","v":0},{"$f":"Blad4!R24","v":0},null,25,null,25,1993,null,null,null,null,null,null,25,1993,"2-1993","VROUW","DAMES","+21 JAAR"," -48 KG."," -52 KG."," -57 KG."," -63 KG."," -70 KG."," -78 KG."," +78 KG.",null,null,null,"JONGENS","-12 JAAR"," +50 KG.","JONGENS/-12 JAAR/ +50 KG.",125,25,"JONGENS/-12 JAAR/ +50 KG."]
[null,null,null,null,null,null,{"$f":"Blad4!F19","v":0},{"$f":"Blad4!G19","v":0},{"$f":"Blad4!H25","v":0},{"$f":"Blad4!I25","v":0},{"$f":"Blad4!J25","v":0},{"$f":"Blad4!K25","v":0},{"$f":"Blad4!L25","v":0},{"$f":"Blad4!M25","v":0},{"$f":"Blad4!N25","v":0},{"$f":"Blad4!O25","v":0},{"$f":"Blad4!P25","v":0},{"$f":"Blad4!Q25","v":0},{"$f":"Blad4!R25","v":0},null,26,null,26,1992,null,null,null,null,null,null,26,1992,"2-1992","VROUW","DAMES","+21 JAAR"," -48 KG."," -52 KG."," -57 KG."," -63 KG."," -70 KG."," -78 KG."," +78 KG.",null,null,null,"JONGENS","-15 JAAR"," -34 KG.","JONGENS/-15 JAAR/ -34 KG.",126,26,"JONGENS/-15 JAAR/ -34 KG."]
[null,null,null,null,null,null,{"$f":"Blad4!F20","v":0},{"$f":"Blad4!G20","v":0},{"$f":"Blad4!H26","v":0},{"$f":"Blad4!I26","v":0},{"$f":"Blad4!J26","v":0},{"$f":"Blad4!K26","v":0},{"$f":"Blad4!L26","v":0},{"$f":"Blad4!M26","v":0},{"$f":"Blad4!N26","v":0},{"$f":"Blad4!O26","v":0},{"$f":"Blad4!P26","v":0},{"$f":"Blad4!Q26","v":0},{"$f":"Blad4!R26","v":0},null,27,null,27,1991,null,null,null,null,null,null,27,1991,"2-1991","VROUW","DAMES","+21 JAAR"," -48 KG."," -52 KG."," -57 KG."," -63 KG."," -70 KG."," -78 KG."," +78 KG.",null,null,null,"JONGENS","-15 JAAR"," -38 KG.","JONGENS/-15 JAAR/ -38 KG.",127,27,"JONGENS/-15 JAAR/ -38 KG."]
[null,null,null,null,null,null,{"$f":"Blad4!F21","v":0},{"$f":"Blad4!G21","v":0},{"$f":"Blad4!H27","v":0},{"$f":"Blad4!I27","v":0},{"$f":"Blad4!J27","v":0},{"$f":"Blad4!K27","v":0},{"$f":"Blad4!L27","v":0},{"$f":"Blad4!M27","v":0},{"$f":"Blad4!N27","v":0},{"$f":"Blad4!O27","v":0},{"$f":"Blad4!P27","v":0},{"$f":"Blad4!Q27","v":0},{"$f":"Blad4!R27","v":0},null,28,null,28,1990,null,null,null,null,null,null,28,1990,"2-1990","VROUW","DAMES","+21 JAAR"," -48 KG."," -52 KG."," -57 KG."," -63 KG."," -70 KG."," -78 KG."," +78 KG.",null,null,null,"JONGENS","-15 JAAR"," -42 KG.","JONGENS/-15 JAAR/ -42 KG.",128,28,"JONGENS/-15 JAAR/ -42 KG."]
[null,null,null,null,null,null,{"$f":"Blad4!F22","v":0},{"$f":"Blad4!G22","v":0},{"$f":"Blad4!H28","v":0},{"$f":"Blad4!I28","v":0},{"$f":"Blad4!J28","v":0},{"$f":"Blad4!K28","v":0},{"$f":"Blad4!L28","v":0},{"$f":"Blad4!M28","v":0},{"$f":"Blad4!N28","v":0},{"$f":"Blad4!O28","v":0},{"$f":"Blad4!P28","v":0},{"$f":"Blad4!Q28","v":0},{"$f":"Blad4!R28","v":0},null,29,null,29,1989,null,null,null,null,null,null,29,1989,"2-1989","VROUW","DAMES","+21 JAAR"," -48 KG."," -52 KG."," -57 KG."," -63 KG."," -70 KG."," -78 KG."," +78 KG.",null,null,null,"JONGENS","-15 JAAR"," -46 KG.","JONGENS/-15 JAAR/ -46 KG.",129,29,"JONGENS/-15 JAAR/ -46 KG."]
[null,null,null,null,null,null,{"$f":"Blad4!F23","v":0},{"$f":"Blad4!G23","v":0},{"$f":"Blad4!H29","v":0},{"$f":"Blad4!I29","v":0},{"$f":"Blad4!J29","v":0},{"$f":"Blad4!K29","v":0},{"$f":"Blad4!L29","v":0},{"$f":"Blad4!M29","v":0},{"$f":"Blad4!N29","v":0},{"$f":"Blad4!O29","v":0},{"$f":"Blad4!P29","v":0},{"$f":"Blad4!Q29","v":0},{"$f":"Blad4!R29","v":0},null,30,null,30,1988,null,null,null,null,null,null,30,1988,"2-1988","VROUW","DAMES","+21 JAAR"," -48 KG."," -52 KG."," -57 KG."," -63 KG."," -70 KG."," -78 KG."," +78 KG.",null,null,null,"JONGENS","-15 JAAR"," -50 KG.","JONGENS/-15 JAAR/ -50 KG.",130,30,"JONGENS/-15 JAAR/ -50 KG."]
[null,null,null,null,null,null,null,null,null,null,null,null,null,null,null,null,null,null,null,null,31,null,31,1987,null,null,null,null,null,null,31,1987,"2-1987","VROUW","DAMES","+21 JAAR"," -48 KG."," -52 KG."," -57 KG."," -63 KG."," -70 KG."," -78 KG."," +78 KG.",null,null,null,"JONGENS","-15 JAAR"," -55 KG.","JONGENS/-15 JAAR/ -55 KG.",131,31,"JONGENS/-15 JAAR/ -55 KG."]
[null,null,null,null,null,null,null,null,null,null,null,null,null,null,null,null,null,null,null,null,null,null,32,1986,null,null,null,null,null,null,32,1986,"2-1986","VROUW","DAMES","+21 JAAR"," -48 KG."," -52 KG."," -57 KG."," -63 KG."," -70 KG."," -78 KG."," +78 KG.",null,null,null,"JONGENS","-15 JAAR"," -60 KG.","JONGENS/-15 JAAR/ -60 KG.",132,32,"JONGENS/-15 JAAR/ -60 KG."]
[null,null,null,null,null,null,null,null,null,null,null,null,null,null,null,null,null,null,null,null,null,null,33,1985,null,null,null,null,null,null,33,1985,"2-1985","VROUW","DAMES","+21 JAAR"," -48 KG."," -52 KG."," -57 KG."," -63 KG."," -70 KG."," -78 KG."," +78 KG.",null,null,null,"JONGENS","-15 JAAR"," -66 KG.","JONGENS/-15 JAAR/ -66 KG.",133,33,"JONGENS/-15 JAAR/ -66 KG."]
[null,null,null,null,null,null,null,null,null,null,null,null,null,null,null,null,null,null,null,null,null,null,34,1984,null,null,null,null,null,null,34,1984,"2-1984","VROUW","DAMES","+21 JAAR"," -48 KG."," -52 KG."," -57 KG."," -63 KG."," -70 KG."," -78 KG."," +78 KG.",null,null,null,"JONGENS","-15 JAAR"," +66 KG.","JONGENS/-15 JAAR/ +66 KG.",134,34,"JONGENS/-15 JAAR/ +66 KG."]
[null,null,null,null,null,null,null,null,null,null,null,null,null,null,null,null,null,null,null,null,null,null,35,1983,null,null,null,null,null,null,35,1983,"2-1983","VROUW","DAMES","+21 JAAR"," -48 KG."," -52 KG."," -57 KG."," -63 KG."," -70 KG."," -78 KG."," +78 KG.",null,null,null,"JONGENS","-18 JAAR"," -46 KG.","JONGENS/-18 JAAR/ -46 KG.",135,35,"JONGENS/-18 JAAR/ -46 KG."]
[null,null,null,null,null,null,null,null,null,null,null,null,null,null,null,null,null,null,null,null,null,null,36,1982,null,null,null,null,null,null,36,1982,"2-1982","VROUW","DAMES","+21 JAAR"," -48 KG."," -52 KG."," -57 KG."," -63 KG."," -70 KG."," -78 KG."," +78 KG.",null,null,null,"JONGENS","-18 JAAR"," -50 KG.","JONGENS/-18 JAAR/ -50 KG.",136,36,"JONGENS/-18 JAAR/ -50 KG."]
[null,null,null,null,null,null,null,null,null,null,null,null,null,null,null,null,null,null,null,null,null,null,37,1981,null,null,null,null,null,null,37,1981,"2-1981","VROUW","DAMES","+21 JAAR"," -48 KG."," -52 KG."," -57 KG."," -63 KG."," -70 KG."," -78 KG."," +78 KG.",null,null,null,"JONGENS","-18 JAAR"," -55 KG.","JONGENS/-18 JAAR/ -55 KG.",137,37,"JONGENS/-18 JAAR/ -55 KG."]
[null,null,null,null,null,null,null,null,null,null,null,null,null,null,null,null,null,null,null,null,null,null,38,1980,null,null,null,null,null,null,38,1980,"2-1980","VROUW","DAMES","+21 JAAR"," -48 KG."," -52 KG."," -57 KG."," -63 KG."," -70 KG."," -78 KG."," +78 KG.",null,null,null,"JONGENS","-18 JAAR"," -60 KG.","JONGENS/-18 JAAR/ -60 KG.",138,38,"JONGENS/-18 JAAR/ -60 KG."]
[null,null,null,null,null,null,null,null,null,null,null,null,null,null,null,null,null,null,null,null,null,null,39,1979,null,null,null,null,null,null,39,1979,"2-1979","VROUW","DAMES","+21 JAAR"," -48 KG."," -52 KG."," -57 KG."," -63 KG."," -70 KG."," -78 KG."," +78 KG.",null,null,null,"JONGENS","-18 JAAR"," -66 KG.","JONGENS/-18 JAAR/ -66 KG.",139,39,"JONGENS/-18 JAAR/ -66 KG."]
[null,null,null,null,null,null,null,null,null,null,null,null,null,null,null,null,null,null,null,null,null,null,40,1978,null,null,null,null,null,null,40,1978,"2-1978","VROUW","DAMES","+21 JAAR"," -48 KG."," -52 KG."," -57 KG."," -63 KG."," -70 KG."," -78 KG."," +78 KG.",null,null,null,"JONGENS","-18 JAAR"," -73 KG.","JONGENS/-18 JAAR/ -73 KG.",140,40,"JONGENS/-18 JAAR/ -73 KG."]
[null,null,null,null,null,null,null,null,null,null,null,null,null,null,null,null,null,null,null,null,null,null,41,1977,null,null,null,null,null,null,41,1977,"2-1977","VROUW","DAMES","+21 JAAR"," -48 KG."," -52 KG."," -57 KG."," -63 KG."," -70 KG."," -78 KG."," +78 KG.",null,null,null,"JONGENS","-18 JAAR"," -81 KG.","JONGENS/-18 JAAR/ -81 KG.",141,41,"JONGENS/-18 JAAR/ -81 KG."]
[null,null,null,null,null,null,null,null,null,null,null,null,null,null,null,null,null,null,null,null,null,null,42,1976,null,null,null,null,null,null,42,1976,"2-1976","VROUW","DAMES","+21 JAAR"," -48 KG."," -52 KG."," -57 KG."," -63 KG."," -70 KG."," -78 KG."," +78 KG.",null,null,null,"JONGENS","-18 JAAR"," -90 KG.","JONGENS/-18 JAAR/ -90 KG.",142,42,"JONGENS/-18 JAAR/ -90 KG."]
[null,null,null,null,null,null,null,null,null,null,null,null,null,null,null,null,null,null,null,null,null,null,43,1975,null,null,null,null,null,null,43,1975,"2-1975","VROUW","DAMES","+21 JAAR"," -48 KG."," -52 KG."," -57 KG."," -63 KG."," -70 KG."," -78 KG."," +78 KG.",null,null,null,"JONGENS","-18 JAAR"," +90 KG.","JONGENS/-18 JAAR/ +90 KG.",143,43,"JONGENS/-18 JAAR/ +90 KG."]
[null,null,null,null,null,null,null,null,null,null,null,null,null,null,null,null,null,null,null,null,null,null,44,1974,null,null,null,null,null,null,44,1974,"2-1974","VROUW","DAMES","+21 JAAR"," -48 KG."," -52 KG."," -57 KG."," -63 KG."," -70 KG."," -78 KG."," +78 KG.",null,null,null,"HEREN","-21 JAAR"," -55 KG.","HEREN/-21 JAAR/ -55 KG.",144,44,"HEREN/-21 JAAR/ -55 KG."]
[null,null,null,null,null,null,null,null,null,null,null,null,null,null,null,null,null,null,null,null,null,null,45,1973,null,null,null,null,null,null,45,1973,"2-1973","VROUW","DAMES","+21 JAAR"," -48 KG."," -52 KG."," -57 KG."," -63 KG."," -70 KG."," -78 KG."," +78 KG.",null,null,null,"HEREN","-21 JAAR"," -60 KG.","HEREN/-21 JAAR/ -60 KG.",145,45,"HEREN/-21 JAAR/ -60 KG."]
[null,null,null,null,null,null,null,null,null,null,null,null,null,null,null,null,null,null,null,null,null,null,46,1972,null,null,null,null,null,null,46,1972,"2-1972","VROUW","DAMES","+21 JAAR"," -48 KG."," -52 KG."," -57 KG."," -63 KG."," -70 KG."," -78 KG."," +78 KG.",null,null,null,"HEREN","-21 JAAR"," -66 KG.","HEREN/-21 JAAR/ -66 KG.",146,46,"HEREN/-21 JAAR/ -66 KG."]
[null,null,null,null,null,null,null,null,null,null,null,null,null,null,null,null,null,null,null,null,null,null,47,1971,null,null,null,null,null,null,47,1971,"2-1971","VROUW","DAMES","+21 JAAR"," -48 KG."," -52 KG."," -57 KG."," -63 KG."," -70 KG."," -78 KG."," +78 KG.",null,null,null,"HEREN","-21 JAAR"," -73 KG.","HEREN/-21 JAAR/ -73 KG.",147,47,"HEREN/-21 JAAR/ -73 KG."]
[null,null,null,null,null,null,null,null,null,null,null,null,null,null,null,null,null,null,null,null,null,null,48,1970,null,null,null,null,null,null,48,1970,"2-1970","VROUW","DAMES","+21 JAAR"," -48 KG."," -52 KG."," -57 KG."," -63 KG."," -70 KG."," -78 KG."," +78 KG.",null,null,null,"HEREN","-21 JAAR"," -81 KG.","HEREN/-21 JAAR/ -81 KG.",148,48,"HEREN/-21 JAAR/ -81 KG."]
[null,null,null,null,null,null,null,null,null,null,null,null,null,null,null,null,null,null,null,null,null,null,49,1969,null,null,null,null,null,null,49,1969,"2-1969","VROUW","DAMES","+21 JAAR"," -48 KG."," -52 KG."," -57 KG."," -63 KG."," -70 KG."," -78 KG."," +78 KG.",null,null,null,"HEREN","-21 JAAR"," -90 KG.","HEREN/-21 JAAR/ -90 KG.",149,49,"HEREN/-21 JAAR/ -90 KG."]
[null,null,null,null,null,null,null,null,null,null,null,null,null,null,null,null,null,null,null,null,null,null,50,1968,null,null,null,null,null,null,50,1968,"2-1968","VROUW","DAMES","+21 JAAR"," -48 KG."," -52 KG."," -57 KG."," -63 KG."," -70 KG."," -78 KG."," +78 KG.",null,null,null,"HEREN","-21 JAAR"," -100 KG.","HEREN/-21 JAAR/ -100 KG.",150,50,"HEREN/-21 JAAR/ -100 KG."]
[null,null,null,null,null,null,null,null,null,null,null,null,null,null,null,null,null,null,null,null,null,null,51,1967,null,null,null,null,null,null,51,1967,"2-1967","VROUW","DAMES","+21 JAAR"," -48 KG."," -52 KG."," -57 KG."," -63 KG."," -70 KG."," -78 KG."," +78 KG.",null,null,null,"HEREN","-21 JAAR"," +100 KG.","HEREN/-21 JAAR/ +100 KG.",151,51,"HEREN/-21 JAAR/ +100 KG."]
[null,null,null,null,null,null,null,null,null,null,null,null,null,null,null,null,null,null,null,null,null,null,52,1966,null,null,null,null,null,null,52,1966,"2-1966","VROUW","DAMES","+21 JAAR"," -48 KG."," -52 KG."," -57 KG."," -63 KG."," -70 KG."," -78 KG."," +78 KG.",null,null,null,"HEREN","+21 JAAR"," -60 KG.","HEREN/+21 JAAR/ -60 KG.",152,52,"HEREN/+21 JAAR/ -60 KG."]
[null,null,null,null,null,null,null,null,null,null,null,null,null,null,null,null,null,null,null,null,null,null,53,1965,null,null,null,null,null,null,53,1965,"2-1965","VROUW","DAMES","+21 JAAR"," -48 KG."," -52 KG."," -57 KG."," -63 KG."," -70 KG."," -78 KG."," +78 KG.",null,null,null,"HEREN","+21 JAAR"," -66 KG.","HEREN/+21 JAAR/ -66 KG.",153,53,"HEREN/+21 JAAR/ -66 KG."]
[null,null,null,null,null,null,null,null,null,null,null,null,null,null,null,null,null,null,null,null,null,null,54,1964,null,null,null,null,null,null,54,1964,"2-1964","VROUW","DAMES","+21 JAAR"," -48 KG."," -52 KG."," -57 KG."," -63 KG."," -70 KG."," -78 KG."," +78 KG.",null,null,null,"HEREN","+21 JAAR"," -73 KG.","HEREN/+21 JAAR/ -73 KG.",154,54,"HEREN/+21 JAAR/ -73 KG."]
[null,null,null,null,null,null,null,null,null,null,null,null,null,null,null,null,null,null,null,null,null,null,55,1963,null,null,null,null,null,null,55,1963,"2-1963","VROUW","DAMES","+21 JAAR"," -48 KG."," -52 KG."," -57 KG."," -63 KG."," -70 KG."," -78 KG."," +78 KG.",null,null,null,"HEREN","+21 JAAR"," -81 KG.","HEREN/+21 JAAR/ -81 KG.",155,55,"HEREN/+21 JAAR/ -81 KG."]
[null,null,null,null,null,null,null,null,null,null,null,null,null,null,null,null,null,null,null,null,null,null,null,null,null,null,null,null,null,null,56,2017,"1-2017","JONGEN","JONGENS","-8 JAAR"," -18 KG."," -21 KG."," -24 KG."," -27 KG."," -30 KG."," -34 KG."," -38 KG."," +38 KG.",null,null,"HEREN","+21 JAAR"," -90 KG.","HEREN/+21 JAAR/ -90 KG.",156,56,"HEREN/+21 JAAR/ -90 KG."]
[null,null,null,null,null,null,null,null,null,null,null,null,null,null,null,null,null,null,null,null,null,null,null,null,null,null,null,null,null,null,57,2016,"1-2016","JONGEN","JONGENS","-8 JAAR"," -18 KG."," -21 KG."," -24 KG."," -27 KG."," -30 KG."," -34 KG."," -38 KG."," +38 KG.",null,null,"HEREN","+21 JAAR"," -100 KG.","HEREN/+21 JAAR/ -100 KG.",157,57,"HEREN/+21 JAAR/ -100 KG."]
[null,null,null,null,null,null,null,null,null,null,null,null,null,null,null,null,null,null,null,null,null,null,null,null,null,null,null,null,null,null,58,2015,"1-2015","JONGEN","JONGENS","-10 JAAR"," -21 KG."," -24 KG."," -27 KG."," -30 KG."," -34 KG."," -38 KG."," -42 KG."," +42 KG.",null,null,"HEREN","+21 JAAR"," +100 KG.","HEREN/+21 JAAR/ +100 KG.",158,58,"HEREN/+21 JAAR/ +100 KG."]
[null,null,null,null,null,null,null,null,null,null,null,null,null,null,null,null,null,null,null,null,null,null,null,null,null,null,null,null,null,null,59,2014,"1-2014","JONGEN","JONGENS","-10 JAAR"," -21 KG."," -24 KG."," -27 KG."," -30 KG."," -34 KG."," -38 KG."," -42 KG."," +42 KG.",null,null,"MEISJES","-8 JAAR"," -18 KG.","MEISJES/-8 JAAR/ -18 KG.",201,59,"MEISJES/-8 JAAR/ -18 KG."]
[null,null,null,null,null,null,null,null,null,null,null,null,null,null,null,null,null,null,null,null,null,null,null,null,null,null,null,null,null,null,60,2013,"1-2013","JONGEN","JONGENS","-12 JAAR"," -24 KG."," -27 KG."," -30 KG."," -34 KG."," -38 KG."," -42 KG."," -46 KG."," -50 KG."," +50 KG.",null,"MEISJES","-8 JAAR"," -20 KG.","MEISJES/-8 JAAR/ -20 KG.",202,60,"MEISJES/-8 JAAR/ -20 KG."]
[null,null,null,null,null,null,null,null,null,null,null,null,null,null,null,null,null,null,null,null,null,null,null,null,null,null,null,null,null,null,61,2012,"1-2012","JONGEN","JONGENS","-12 JAAR"," -24 KG."," -27 KG."," -30 KG."," -34 KG."," -38 KG."," -42 KG."," -46 KG."," -50 KG."," +50 KG.",null,"MEISJES","-8 JAAR"," -22 KG.","MEISJES/-8 JAAR/ -22 KG.",203,61,"MEISJES/-8 JAAR/ -22 KG."]
[null,null,null,null,null,null,null,null,null,null,null,null,null,null,null,null,null,null,null,null,null,null,null,null,null,null,null,null,null,null,62,2011,"1-2011","JONGEN","JONGENS","-15 JAAR"," -34 KG."," -38 KG."," -42 KG."," -46 KG."," -50 KG."," -55 KG."," -60 KG."," -66 KG."," +66 KG.",null,"MEISJES","-8 JAAR"," -25 KG.","MEISJES/-8 JAAR/ -25 KG.",204,62,"MEISJES/-8 JAAR/ -25 KG."]
[null,null,null,null,null,null,null,null,null,null,null,null,null,null,null,null,null,null,null,null,null,null,null,null,null,null,null,null,null,null,63,2010,"1-2010","JONGEN","JONGENS","-15 JAAR"," -34 KG."," -38 KG."," -42 KG."," -46 KG."," -50 KG."," -55 KG."," -60 KG."," -66 KG."," +66 KG.",null,"MEISJES","-8 JAAR"," -28 KG.","MEISJES/-8 JAAR/ -28 KG.",205,63,"MEISJES/-8 JAAR/ -28 KG."]
[null,null,null,null,null,null,null,null,null,null,null,null,null,null,null,null,null,null,null,null,null,null,null,null,null,null,null,null,null,null,64,2009,"1-2009","JONGEN","JONGENS","-15 JAAR"," -34 KG."," -38 KG."," -42 KG."," -46 KG."," -50 KG."," -55 KG."," -60 KG."," -66 KG."," +66 KG.",null,"MEISJES","-8 JAAR"," -32 KG.","MEISJES/-8 JAAR/ -32 KG.",206,64,"MEISJES/-8 JAAR/ -32 KG."]
[null,null,null,null,null,null,null,null,null,null,null,null,null,null,null,null,null,null,null,null,null,null,null,null,null,null,null,null,null,null,65,2008,"1-2008","JONGEN","JONGENS","-18 JAAR"," -46 KG."," -50 KG."," -55 KG."," -60 KG."," -66 KG."," -73 KG."," -81 KG."," -90 KG."," +90 KG.",null,"MEISJES","-8 JAAR"," -36 KG.","MEISJES/-8 JAAR/ -36 KG.",207,65,"MEISJES/-8 JAAR/ -36 KG."]
[null,null,null,null,null,null,null,null,null,null,null,null,null,null,null,null,null,null,null,null,null,null,null,null,null,null,null,null,null,null,66,2007,"1-2007","JONGEN","JONGENS","-18 JAAR"," -46 KG."," -50 KG."," -55 KG."," -60 KG."," -66 KG."," -73 KG."," -81 KG."," -90 KG."," +90 KG.",null,"MEISJES","-8 JAAR","+36 KG.","MEISJES/-8 JAAR/+36 KG.",208,66,"MEISJES/-8 JAAR/+36 KG."]
[null,null,null,null,null,null,null,null,null,null,null,null,null,null,null,null,null,null,null,null,null,null,null,null,null,null,null,null,null,null,67,2006,"1-2006","JONGEN","JONGENS","-18 JAAR"," -46 KG."," -50 KG."," -55 KG."," -60 KG."," -66 KG."," -73 KG."," -81 KG."," -90 KG."," +90 KG.",null,"MEISJES","-10 JAAR"," -20 KG.","MEISJES/-10 JAAR/ -20 KG.",209,67,"MEISJES/-10 JAAR/ -20 KG."]
[null,null,null,null,null,null,null,null,null,null,null,null,null,null,null,null,null,null,null,null,null,null,null,null,null,null,null,null,null,null,68,2005,"1-2005","MAN","HEREN","-21 JAAR"," -55 KG."," -60 KG."," -66 KG."," -73 KG."," -81 KG."," -90 KG."," -100 KG."," +100 KG.",null,null,"MEISJES","-10 JAAR"," -22 KG.","MEISJES/-10 JAAR/ -22 KG.",210,68,"MEISJES/-10 JAAR/ -22 KG."]
[null,null,null,null,null,null,null,null,null,null,null,null,null,null,null,null,null,null,null,null,null,null,null,null,null,null,null,null,null,null,69,2004,"1-2004","MAN","HEREN","-21 JAAR"," -55 KG."," -60 KG."," -66 KG."," -73 KG."," -81 KG."," -90 KG."," -100 KG."," +100 KG.",null,null,"MEISJES","-10 JAAR"," -25 KG.","MEISJES/-10 JAAR/ -25 KG.",211,69,"MEISJES/-10 JAAR/ -25 KG."]
[null,null,null,null,null,null,null,null,null,null,null,null,null,null,null,null,null,null,null,null,null,null,null,null,null,null,null,null,null,null,70,2003,"1-2003","MAN","HEREN","-21 JAAR"," -55 KG."," -60 KG."," -66 KG."," -73 KG."," -81 KG."," -90 KG."," -100 KG."," +100 KG.",null,null,"MEISJES","-10 JAAR"," -28 KG.","MEISJES/-10 JAAR/ -28 KG.",212,70,"MEISJES/-10 JAAR/ -28 KG."]
[null,null,null,null,null,null,null,null,null,null,null,null,null,null,null,null,null,null,null,null,null,null,null,null,null,null,null,null,null,null,71,2002,"1-2002","MAN","HEREN","+21 JAAR"," -60 KG."," -66 KG."," -73 KG."," -81 KG."," -90 KG."," -100 KG."," +100 KG.",null,null,null,"MEISJES","-10 JAAR"," -32 KG.","MEISJES/-10 JAAR/ -32 KG.",213,71,"MEISJES/-10 JAAR/ -32 KG."]
[null,null,null,null,null,null,null,null,null,null,null,null,null,null,null,null,null,null,null,null,null,null,null,null,null,null,null,null,null,null,72,2001,"1-2001","MAN","HEREN","+21 JAAR"," -60 KG."," -66 KG."," -73 KG."," -81 KG."," -90 KG."," -100 KG."," +100 KG.",null,null,null,"MEISJES","-10 JAAR"," -36 KG.","MEISJES/-10 JAAR/ -36 KG.",214,72,"MEISJES/-10 JAAR/ -36 KG."]
[null,null,null,null,null,null,null,null,null,null,null,null,null,null,null,null,null,null,null,null,null,null,null,null,null,null,null,null,null,null,73,2000,"1-2000","MAN","HEREN","+21 JAAR"," -60 KG."," -66 KG."," -73 KG."," -81 KG."," -90 KG."," -100 KG."," +100 KG.",null,null,null,"MEISJES","-10 JAAR"," -40 KG.","MEISJES/-10 JAAR/ -40 KG.",215,73,"MEISJES/-10 JAAR/ -40 KG."]
[null,null,null,null,null,null,null,null,null,null,null,null,null,null,null,null,null,null,null,null,null,null,null,null,null,null,null,null,null,null,74,1999,"1-1999","MAN","HEREN","+21 JAAR"," -60 KG."," -66 KG."," -73 KG."," -81 KG."," -90 KG."," -100 KG."," +100 KG.",null,null,null,"MEISJES","-10 JAAR","+40 KG.","MEISJES/-10 JAAR/+40 KG.",216,74,"MEISJES/-10 JAAR/+40 KG."]
[null,null,null,null,null,null,null,null,null,null,null,null,null,null,null,null,null,null,null,null,null,null,null,null,null,null,null,null,null,null,75,1998,"1-1998","MAN","HEREN","+21 JAAR"," -60 KG."," -66 KG."," -73 KG."," -81 KG."," -90 KG."," -100 KG."," +100 KG.",null,null,null,"MEISJES","-12 JAAR"," -22 KG.","MEISJES/-12 JAAR/ -22 KG.",217,75,"MEISJES/-12 JAAR/ -22 KG."]
[null,null,null,null,null,null,null,null,null,null,null,null,null,null,null,null,null,null,null,null,null,null,null,null,null,null,null,null,null,null,76,1997,"1-1997","MAN","HEREN","+21 JAAR"," -60 KG."," -66 KG."," -73 KG."," -81 KG."," -90 KG."," -100 KG."," +100 KG.",null,null,null,"MEISJES","-12 JAAR"," -25KG.","MEISJES/-12 JAAR/ -25KG.",218,76,"MEISJES/-12 JAAR/ -25KG."]
[null,null,null,null,null,null,null,null,null,null,null,null,null,null,null,null,null,null,null,null,null,null,null,null,null,null,null,null,null,null,77,1996,"1-1996","MAN","HEREN","+21 JAAR"," -60 KG."," -66 KG."," -73 KG."," -81 KG."," -90 KG."," -100 KG."," +100 KG.",null,null,null,"MEISJES","-12 JAAR"," -28 KG.","MEISJES/-12 JAAR/ -28 KG.",219,77,"MEISJES/-12 JAAR/ -28 KG."]
[null,null,null,null,null,null,null,null,null,null,null,null,null,null,null,null,null,null,null,null,null,null,null,null,null,null,null,null,null,null,78,1995,"1-1995","MAN","HEREN","+21 JAAR"," -60 KG."," -66 KG."," -73 KG."," -81 KG."," -90 KG."," -100 KG."," +100 KG.",null,null,null,"MEISJES","-12 JAAR"," -32 KG.","MEISJES/-12 JAAR/ -32 KG.",220,78,"MEISJES/-12 JAAR/ -32 KG."]
[null,null,null,null,null,null,null,null,null,null,null,null,null,null,null,null,null,null,null,null,null,null,null,null,null,null,null,null,null,null,79,1994,"1-1994","MAN","HEREN","+21 JAAR"," -60 KG."," -66 KG."," -73 KG."," -81 KG."," -90 KG."," -100 KG."," +100 KG.",null,null,null,"MEISJES","-12 JAAR"," -36 KG.","MEISJES/-12 JAAR/ -36 KG.",221,79,"MEISJES/-12 JAAR/ -36 KG."]
[null,null,null,null,null,null,null,null,null,null,null,null,null,null,null,null,null,null,null,null,null,null,null,null,null,null,null,null,null,null,80,1993,"1-1993","MAN","HEREN","+21 JAAR"," -60 KG."," -66 KG."," -73 KG."," -81 KG."," -90 KG."," -100 KG."," +100 KG.",null,null,null,"MEISJES","-12 JAAR"," -40 KG.","MEISJES/-12 JAAR/ -40 KG.",222,80,"MEISJES/-12 JAAR/ -40 KG."]
[null,null,null,null,null,null,null,null,null,null,null,null,null,null,null,null,null,null,null,null,null,null,null,null,null,null,null,null,null,null,81,1992,"1-1992","MAN","HEREN","+21 JAAR"," -60 KG."," -66 KG."," -73 KG."," -81 KG."," -90 KG."," -100 KG."," +100 KG.",null,null,null,"MEISJES","-12 JAAR"," -44 KG.","MEISJES/-12 JAAR/ -44 KG.",223,81,"MEISJES/-12 JAAR/ -44 KG."]
[null,null,null,null,null,null,null,null,null,null,null,null,null,null,null,null,null,null,null,null,null,null,null,null,null,null,null,null,null,null,82,1991,"1-1991","MAN","HEREN","+21 JAAR"," -60 KG."," -66 KG."," -73 KG."," -81 KG."," -90 KG."," -100 KG."," +100 KG.",null,null,null,"MEISJES","-12 JAAR"," -48 KG.","MEISJES/-12 JAAR/ -48 KG.",224,82,"MEISJES/-12 JAAR/ -48 KG."]
[null,null,null,null,null,null,null,null,null,null,null,null,null,null,null,null,null,null,null,null,null,null,null,null,null,null,null,null,null,null,83,1990,"1-1990","MAN","HEREN","+21 JAAR"," -60 KG."," -66 KG."," -73 KG."," -81 KG."," -90 KG."," -100 KG."," +100 KG.",null,null,null,"MEISJES","-12 JAAR"," +48 KG.","MEISJES/-12 JAAR/ +48 KG.",225,83,"MEISJES/-12 JAAR/ +48 KG."]
[null,null,null,null,null,null,null,null,null,null,null,null,null,null,null,null,null,null,null,null,null,null,null,null,null,null,null,null,null,null,84,1989,"1-1989","MAN","HEREN","+21 JAAR"," -60 KG."," -66 KG."," -73 KG."," -81 KG."," -90 KG."," -100 KG."," +100 KG.",null,null,null,"MEISJES","-15 JAAR"," -32 KG.","MEISJES/-15 JAAR/ -32 KG.",226,84,"MEISJES/-15 JAAR/ -32 KG."]
[null,null,null,null,null,null,null,null,null,null,null,null,null,null,null,null,null,null,null,null,null,null,null,null,null,null,null,null,null,null,85,1988,"1-1988","MAN","HEREN","+21 JAAR"," -60 KG."," -66 KG."," -73 KG."," -81 KG."," -90 KG."," -100 KG."," +100 KG.",null,null,null,"MEISJES","-15 JAAR"," -36 KG.","MEISJES/-15 JAAR/ -36 KG.",227,85,"MEISJES/-15 JAAR/ -36 KG."]
[null,null,null,null,null,null,null,null,null,null,null,null,null,null,null,null,null,null,null,null,null,null,null,null,null,null,null,null,null,null,86,1987,"1-1987","MAN","HEREN","+21 JAAR"," -60 KG."," -66 KG."," -73 KG."," -81 KG."," -90 KG."," -100 KG."," +100 KG.",null,null,null,"MEISJES","-15 JAAR"," -40 KG.","MEISJES/-15 JAAR/ -40 KG.",228,86,"MEISJES/-15 JAAR/ -40 KG."]
[null,null,null,null,null,null,null,null,null,null,null,null,null,null,null,null,null,null,null,null,null,null,null,null,null,null,null,null,null,null,87,1986,"1-1986","MAN","HEREN","+21 JAAR"," -60 KG."," -66 KG."," -73 KG."," -81 KG."," -90 KG."," -100 KG."," +100 KG.",null,null,null,"MEISJES","-15 JAAR"," -44 KG.","MEISJES/-15 JAAR/ -44 KG.",229,87,"MEISJES/-15 JAAR/ -44 KG."]
[null,null,null,null,null,null,null,null,null,null,null,null,null,null,null,null,null,null,null,null,null,null,null,null,null,null,null,null,null,null,88,1985,"1-1985","MAN","HEREN","+21 JAAR"," -60 KG."," -66 KG."," -73 KG."," -81 KG."," -90 KG."," -100 KG."," +100 KG.",null,null,null,"MEISJES","-15 JAAR"," -48 KG.","MEISJES/-15 JAAR/ -48 KG.",230,88,"MEISJES/-15 JAAR/ -48 KG."]
[null,null,null,null,null,null,null,null,null,null,null,null,null,null,null,null,null,null,null,null,null,null,null,null,null,null,null,null,null,null,89,1984,"1-1984","MAN","HEREN","+21 JAAR"," -60 KG."," -66 KG."," -73 KG."," -81 KG."," -90 KG."," -100 KG."," +100 KG.",null,null,null,"MEISJES","-15 JAAR"," -52 KG.","MEISJES/-15 JAAR/ -52 KG.",231,89,"MEISJES/-15 JAAR/ -52 KG."]
[null,null,null,null,null,null,null,null,null,null,null,null,null,null,null,null,null,null,null,null,null,null,null,null,null,null,null,null,null,null,90,1983,"1-1983","MAN","HEREN","+21 JAAR"," -60 KG."," -66 KG."," -73 KG."," -81 KG."," -90 KG."," -100 KG."," +100 KG.",null,null,null,"MEISJES","-15 JAAR"," -57 KG.","MEISJES/-15 JAAR/ -57 KG.",232,90,"MEISJES/-15 JAAR/ -57 KG."]
[null,null,null,null,null,null,null,null,null,null,null,null,null,null,null,null,null,null,null,null,null,null,null,null,null,null,null,null,null,null,91,1982,"1-1982","MAN","HEREN","+21 JAAR"," -60 KG."," -66 KG."," -73 KG."," -81 KG."," -90 KG."," -100 KG."," +100 KG.",null,null,null,"MEISJES","-15 JAAR"," -63 KG.","MEISJES/-15 JAAR/ -63 KG.",233,91,"MEISJES/-15 JAAR/ -63 KG."]
[null,null,null,null,null,null,null,null,null,null,null,null,null,null,null,null,null,null,null,null,null,null,null,null,null,null,null,null,null,null,92,1981,"1-1981","MAN","HEREN","+21 JAAR"," -60 KG."," -66 KG."," -73 KG."," -81 KG."," -90 KG."," -100 KG."," +100 KG.",null,null,null,"MEISJES","-15 JAAR"," +63 KG.","MEISJES/-15 JAAR/ +63 KG.",234,92,"MEISJES/-15 JAAR/ +63 KG."]
[null,null,null,null,null,null,null,null,null,null,null,null,null,null,null,null,null,null,null,null,null,null,null,null,null,null,null,null,null,null,93,1980,"1-1980","MAN","HEREN","+21 JAAR"," -60 KG."," -66 KG."," -73 KG."," -81 KG."," -90 KG."," -100 KG."," +100 KG.",null,null,null,"MEISJES","-18 JAAR","-40 KG.","MEISJES/-18 JAAR/-40 KG.",235,93,"MEISJES/-18 JAAR/-40 KG."]
[null,null,null,null,null,null,null,null,null,null,null,null,null,null,null,null,null,null,null,null,null,null,null,null,null,null,null,null,null,null,94,1979,"1-1979","MAN","HEREN","+21 JAAR"," -60 KG."," -66 KG."," -73 KG."," -81 KG."," -90 KG."," -100 KG."," +100 KG.",null,null,null,"MEISJES","-18 JAAR","-44 KG.","MEISJES/-18 JAAR/-44 KG.",236,94,"MEISJES/-18 JAAR/-44 KG."]
[null,null,null,null,null,null,null,null,null,null,null,null,null,null,null,null,null,null,null,null,null,null,null,null,null,null,null,null,null,null,95,1978,"1-1978","MAN","HEREN","+21 JAAR"," -60 KG."," -66 KG."," -73 KG."," -81 KG."," -90 KG."," -100 KG."," +100 KG.",null,null,null,"MEISJES","-18 JAAR","-48 KG.","MEISJES/-18 JAAR/-48 KG.",237,95,"MEISJES/-18 JAAR/-48 KG."]
[null,null,null,null,null,null,null,null,null,null,null,null,null,null,null,null,null,null,null,null,null,null,null,null,null,null,null,null,null,null,96,1977,"1-1977","MAN","HEREN","+21 JAAR"," -60 KG."," -66 KG."," -73 KG."," -81 KG."," -90 KG."," -100 KG."," +100 KG.",null,null,null,"MEISJES","-18 JAAR","-52 KG.","MEISJES/-18 JAAR/-52 KG.",238,96,"MEISJES/-18 JAAR/-52 KG."]
[null,null,null,null,null,null,null,null,null,null,null,null,null,null,null,null,null,null,null,null,null,null,null,null,null,null,null,null,null,null,97,1976,"1-1976","MAN","HEREN","+21 JAAR"," -60 KG."," -66 KG."," -73 KG."," -81 KG."," -90 KG."," -100 KG."," +100 KG.",null,null,null,"MEISJES","-18 JAAR","-57 KG.","MEISJES/-18 JAAR/-57 KG.",239,97,"MEISJES/-18 JAAR/-57 KG."]
[null,null,null,null,null,null,null,null,null,null,null,null,null,null,null,null,null,null,null,null,null,null,null,null,null,null,null,null,null,null,98,1975,"1-1975","MAN","HEREN","+21 JAAR"," -60 KG."," -66 KG."," -73 KG."," -81 KG."," -90 KG."," -100 KG."," +100 KG.",null,null,null,"MEISJES","-18 JAAR","-63 KG.","MEISJES/-18 JAAR/-63 KG.",240,98,"MEISJES/-18 JAAR/-63 KG."]
[null,null,null,null,null,null,null,null,null,null,null,null,null,null,null,null,null,null,null,null,null,null,null,null,null,null,null,null,null,null,99,1974,"1-1974","MAN","HEREN","+21 JAAR"," -60 KG."," -66 KG."," -73 KG."," -81 KG."," -90 KG."," -100 KG."," +100 KG.",null,null,null,"MEISJES","-18 JAAR","-70 KG.","MEISJES/-18 JAAR/-70 KG.",241,99,"MEISJES/-18 JAAR/-70 KG."]
[null,null,null,null,null,null,null,null,null,null,null,null,null,null,null,null,null,null,null,null,null,null,null,null,null,null,null,null,null,null,100,1973,"1-1973","MAN","HEREN","+21 JAAR"," -60 KG."," -66 KG."," -73 KG."," -81 KG."," -90 KG."," -100 KG."," +100 KG.",null,null,null,"MEISJES","-18 JAAR","+70 KG.","MEISJES/-18 JAAR/+70 KG.",242,100,"MEISJES/-18 JAAR/+70 KG."]
[null,null,null,null,null,null,null,null,null,null,null,null,null,null,null,null,null,null,null,null,null,null,null,null,null,null,null,null,null,null,101,1972,"1-1972","MAN","HEREN","+21 JAAR"," -60 KG."," -66 KG."," -73 KG."," -81 KG."," -90 KG."," -100 KG."," +100 KG.",null,null,null,"DAMES","-21 JAAR"," -44 KG.","DAMES/-21 JAAR/ -44 KG.",243,101,"DAMES/-21 JAAR/ -44 KG."]
[null,null,null,null,null,null,null,null,null,null,null,null,null,null,null,null,null,null,null,null,null,null,null,null,null,null,null,null,null,null,102,1971,"1-1971","MAN","HEREN","+21 JAAR"," -60 KG."," -66 KG."," -73 KG."," -81 KG."," -90 KG."," -100 KG."," +100 KG.",null,null,null,"DAMES","-21 JAAR"," -48 KG.","DAMES/-21 JAAR/ -48 KG.",244,102,"DAMES/-21 JAAR/ -48 KG."]
[null,null,null,null,null,null,null,null,null,null,null,null,null,null,null,null,null,null,null,null,null,null,null,null,null,null,null,null,null,null,103,1970,"1-1970","MAN","HEREN","+21 JAAR"," -60 KG."," -66 KG."," -73 KG."," -81 KG."," -90 KG."," -100 KG."," +100 KG.",null,null,null,"DAMES","-21 JAAR"," -52 KG.","DAMES/-21 JAAR/ -52 KG.",245,103,"DAMES/-21 JAAR/ -52 KG."]
[null,null,null,null,null,null,null,null,null,null,null,null,null,null,null,null,null,null,null,null,null,null,null,null,null,null,null,null,null,null,104,1969,"1-1969","MAN","HEREN","+21 JAAR"," -60 KG."," -66 KG."," -73 KG."," -81 KG."," -90 KG."," -100 KG."," +100 KG.",null,null,null,"DAMES","-21 JAAR"," -57 KG.","DAMES/-21 JAAR/ -57 KG.",246,104,"DAMES/-21 JAAR/ -57 KG."]
[null,null,null,null,null,null,null,null,null,null,null,null,null,null,null,null,null,null,null,null,null,null,null,null,null,null,null,null,null,null,105,1968,"1-1968","MAN","HEREN","+21 JAAR"," -60 KG."," -66 KG."," -73 KG."," -81 KG."," -90 KG."," -100 KG."," +100 KG.",null,null,null,"DAMES","-21 JAAR"," -63 KG.","DAMES/-21 JAAR/ -63 KG.",247,105,"DAMES/-21 JAAR/ -63 KG."]
[null,null,null,null,null,null,null,null,null,null,null,null,null,null,null,null,null,null,null,null,null,null,null,null,null,null,null,null,null,null,106,1967,"1-1967","MAN","HEREN","+21 JAAR"," -60 KG."," -66 KG."," -73 KG."," -81 KG."," -90 KG."," -100 KG."," +100 KG.",null,null,null,"DAMES","-21 JAAR"," -70 KG.","DAMES/-21 JAAR/ -70 KG.",248,106,"DAMES/-21 JAAR/ -70 KG."]
[null,null,null,null,null,null,null,null,null,null,null,null,null,null,null,null,null,null,null,null,null,null,null,null,null,null,null,null,null,null,107,1966,"1-1966","MAN","HEREN","+21 JAAR"," -60 KG."," -66 KG."," -73 KG."," -81 KG."," -90 KG."," -100 KG."," +100 KG.",null,null,null,"DAMES","-21 JAAR"," -78 KG.","DAMES/-21 JAAR/ -78 KG.",249,107,"DAMES/-21 JAAR/ -78 KG."]
[null,null,null,null,null,null,null,null,null,null,null,null,null,null,null,null,null,null,null,null,null,null,null,null,null,null,null,null,null,null,108,1965,"1-1965","MAN","HEREN","+21 JAAR"," -60 KG."," -66 KG."," -73 KG."," -81 KG."," -90 KG."," -100 KG."," +100 KG.",null,null,null,"DAMES","-21 JAAR"," +78 KG.","DAMES/-21 JAAR/ +78 KG.",250,108,"DAMES/-21 JAAR/ +78 KG."]
[null,null,null,null,null,null,null,null,null,null,null,null,null,null,null,null,null,null,null,null,null,null,null,null,null,null,null,null,null,null,109,1964,"1-1964","MAN","HEREN","+21 JAAR"," -60 KG."," -66 KG."," -73 KG."," -81 KG."," -90 KG."," -100 KG."," +100 KG.",null,null,null,"DAMES","+21 JAAR"," -48 KG.","DAMES/+21 JAAR/ -48 KG.",251,109,"DAMES/+21 JAAR/ -48 KG."]
[null,null,null,null,null,null,null,null,null,null,null,null,null,null,null,null,null,null,null,null,null,null,null,null,null,null,null,null,null,null,110,1963,"1-1963","MAN","HEREN","+21 JAAR"," -60 KG."," -66 KG."," -73 KG."," -81 KG."," -90 KG."," -100 KG."," +100 KG.",null,null,null,"DAMES","+21 JAAR"," -52 KG.","DAMES/+21 JAAR/ -52 KG.",252,110,"DAMES/+21 JAAR/ -52 KG."]
[null,null,null,null,null,null,null,null,null,null,null,null,null,null,null,null,null,null,null,null,null,null,null,null,null,null,null,null,null,null,null,null,null,null,null,null,null,null,null,null,null,null,null,null,null,null,"DAMES","+21 JAAR"," -57 KG.","DAMES/+21 JAAR/ -57 KG.",253,111,"DAMES/+21 JAAR/ -57 KG."]
[null,null,null,null,null,null,null,null,null,null,null,null,null,null,null,null,null,null,null,null,null,null,null,null,null,null,null,null,null,null,null,null,null,null,null,null,null,null,null,null,null,null,null,null,null,null,"DAMES","+21 JAAR"," -63 KG.","DAMES/+21 JAAR/ -63 KG.",254,112,"DAMES/+21 JAAR/ -63 KG."]
[null,null,null,null,null,null,null,null,null,null,null,null,null,null,null,null,null,null,null,null,null,null,null,null,null,null,null,null,null,null,null,null,null,null,null,null,null,null,null,null,null,null,null,null,null,null,"DAMES","+21 JAAR"," -70 KG.","DAMES/+21 JAAR/ -70 KG.",255,113,"DAMES/+21 JAAR/ -70 KG."]
[null,null,null,null,null,null,null,null,null,null,null,null,null,null,null,null,null,null,null,null,null,null,null,null,null,null,null,null,null,null,null,null,null,null,null,null,null,null,null,null,null,null,null,null,null,null,"DAMES","+21 JAAR"," -78 KG.","DAMES/+21 JAAR/ -78 KG.",256,114,"DAMES/+21 JAAR/ -78 KG."]
[null,null,null,null,null,null,null,null,null,null,null,null,null,null,null,null,null,null,null,null,null,null,null,null,null,null,null,null,null,null,null,null,null,null,null,null,null,null,null,null,null,null,null,null,null,null,"DAMES","+21 JAAR"," +78 KG.",{"$f":"CONCATENATE(AU118,\"/\",AV118,\"/\",AW118)","v":"DAMES/+21 JAAR/ +78 KG."},257,115,"DAMES/+21 JAAR/ +78 KG."]

{"sheet":"GEWICHT PER INSCHRIJVING","index":6,"n_rows":10,"n_cols":31,"rows_kept":10,"cut":false,"hidden":false,"merged":[]}
[null,1,2,3,4,5,6,7,8,9,10,11,12,13,14,15,16,17,18,19,20,21,22,23,24,25,26,27,28,29,30]
[1,{"$f":"IF(ISERROR(VLOOKUP('INVOER JUDOKA''S'!$P$26,'GEGEVENS-2023'!$AG$4:$AS$113,5,FALSE)),\"\",VLOOKUP('INVOER JUDOKA''S'!$P$26,'GEGEVENS-2023'!$AG$4:$AS$113,5,FALSE))","v":""},{"$f":"IF(ISERROR(VLOOKUP('INVOER JUDOKA''S'!$P$27,'GEGEVENS-2023'!$AG$4:$AS$113,5,FALSE)),\"\",VLOOKUP('INVOER JUDOKA''S'!$P$27,'GEGEVENS-2023'!$AG$4:$AS$113,5,FALSE))","v":""},{"$f":"IF(ISERROR(VLOOKUP('INVOER JUDOKA''S'!$P$28,'GEGEVENS-2023'!$AG$4:$AS$113,5,FALSE)),\"\",VLOOKUP('INVOER JUDOKA''S'!$P$28,'GEGEVENS-2023'!$AG$4:$AS$113,5,FALSE))","v":""},{"$f":"IF(ISERROR(VLOOKUP('INVOER JUDOKA''S'!$P$29,'GEGEVENS-2023'!$AG$4:$AS$113,5,FALSE)),\"\",VLOOKUP('INVOER JUDOKA''S'!$P$29,'GEGEVENS-2023'!$AG$4:$AS$113,5,FALSE))","v":""},{"$f":"IF(ISERROR(VLOOKUP('INVOER JUDOKA''S'!$P$30,'GEGEVENS-2023'!$AG$4:$AS$113,5,FALSE)),\"\",VLOOKUP('INVOER JUDOKA''S'!$P$30,'GEGEVENS-2023'!$AG$4:$AS$113,5,FALSE))","v":""},{"$f":"IF(ISERROR(VLOOKUP('INVOER JUDOKA''S'!$P$31,'GEGEVENS-2023'!$AG$4:$AS$113,5,FALSE)),\"\",VLOOKUP('INVOER JUDOKA''S'!$P$31,'GEGEVENS-2023'!$AG$4:$AS$113,5,FALSE))","v":""},{"$f":"IF(ISERROR(VLOOKUP('INVOER JUDOKA''S'!$P$32,'GEGEVENS-2023'!$AG$4:$AS$113,5,FALSE)),\"\",VLOOKUP('INVOER JUDOKA''S'!$P$32,'GEGEVENS-2023'!$AG$4:$AS$113,5,FALSE))","v":""},{"$f":"IF(ISERROR(VLOOKUP('INVOER JUDOKA''S'!$P$33,'GEGEVENS-2023'!$AG$4:$AS$113,5,FALSE)),\"\",VLOOKUP('INVOER JUDOKA''S'!$P$33,'GEGEVENS-2023'!$AG$4:$AS$113,5,FALSE))","v":""},{"$f":"IF(ISERROR(VLOOKUP('INVOER JUDOKA''S'!$P$34,'GEGEVENS-2023'!$AG$4:$AS$113,5,FALSE)),\"\",VLOOKUP('INVOER JUDOKA''S'!$P$34,'GEGEVENS-2023'!$AG$4:$AS$113,5,FALSE))","v":""},{"$f":"IF(ISERROR(VLOOKUP('INVOER JUDOKA''S'!$P$35,'GEGEVENS-2023'!$AG$4:$AS$113,5,FALSE)),\"\",VLOOKUP('INVOER JUDOKA''S'!$P$35,'GEGEVENS-2023'!$AG$4:$AS$113,5,FALSE))","v":""},{"$f":"IF(ISERROR(VLOOKUP('INVOER JUDOKA''S'!$P$36,'GEGEVENS-2023'!$AG$4:$AS$113,5,FALSE)),\"\",VLOOKUP('INVOER JUDOKA''S'!$P$36,'GEGEVENS-2023'!$AG$4:$AS$113,5,FALSE))","v":""},{"$f":"IF(ISERROR(VLOOKUP('INVOER JUDOKA''S'!$P$37,'GEGEVENS-2023'!$AG$4:$AS$113,5,FALSE)),\"\",VLOOKUP('INVOER JUDOKA''S'!$P$37,'GEGEVENS-2023'!$AG$4:$AS$113,5,FALSE))","v":""},{"$f":"IF(ISERROR(VLOOKUP('INVOER JUDOKA''S'!$P$38,'GEGEVENS-2023'!$AG$4:$AS$113,5,FALSE)),\"\",VLOOKUP('INVOER JUDOKA''S'!$P$38,'GEGEVENS-2023'!$AG$4:$AS$113,5,FALSE))","v":""},{"$f":"IF(ISERROR(VLOOKUP('INVOER JUDOKA''S'!$P$39,'GEGEVENS-2023'!$AG$4:$AS$113,5,FALSE)),\"\",VLOOKUP('INVOER JUDOKA''S'!$P$39,'GEGEVENS-2023'!$AG$4:$AS$113,5,FALSE))","v":""},{"$f":"IF(ISERROR(VLOOKUP('INVOER JUDOKA''S'!$P$40,'GEGEVENS-2023'!$AG$4:$AS$113,5,FALSE)),\"\",VLOOKUP('INVOER JUDOKA''S'!$P$40,'GEGEVENS-2023'!$AG$4:$AS$113,5,FALSE))","v":""},{"$f":"IF(ISERROR(VLOOKUP('INVOER JUDOKA''S'!$P$41,'GEGEVENS-2023'!$AG$4:$AS$113,5,FALSE)),\"\",VLOOKUP('INVOER JUDOKA''S'!$P$41,'GEGEVENS-2023'!$AG$4:$AS$113,5,FALSE))","v":""},{"$f":"IF(ISERROR(VLOOKUP('INVOER JUDOKA''S'!$P$42,'GEGEVENS-2023'!$AG$4:$AS$113,5,FALSE)),\"\",VLOOKUP('INVOER JUDOKA''S'!$P$42,'GEGEVENS-2023'!$AG$4:$AS$113,5,FALSE))","v":""},{"$f":"IF(ISERROR(VLOOKUP('INVOER JUDOKA''S'!$P$43,'GEGEVENS-2023'!$AG$4:$AS$113,5,FALSE)),\"\",VLOOKUP('INVOER JUDOKA''S'!$P$43,'GEGEVENS-2023'!$AG$4:$AS$113,5,FALSE))","v":""},{"$f":"IF(ISERROR(VLOOKUP('INVOER JUDOKA''S'!$P$44,'GEGEVENS-2023'!$AG$4:$AS$113,5,FALSE)),\"\",VLOOKUP('INVOER JUDOKA''S'!$P$44,'GEGEVENS-2023'!$AG$4:$AS$113,5,FALSE))","v":""},{"$f":"IF(ISERROR(VLOOKUP('INVOER JUDOKA''S'!$P$45,'GEGEVENS-2023'!$AG$4:$AS$113,5,FALSE)),\"\",VLOOKUP('INVOER JUDOKA''S'!$P$45,'GEGEVENS-2023'!$AG$4:$AS$113,5,FALSE))","v":""},{"$f":"IF(ISERROR(VLOOKUP('INVOER JUDOKA''S'!$P$46,'GEGEVENS-2023'!$AG$4:$AS$113,5,FALSE)),\"\",VLOOKUP('INVOER JUDOKA''S'!$P$46,'GEGEVENS-2023'!$AG$4:$AS$113,5,FALSE))","v":""},{"$f":"IF(ISERROR(VLOOKUP('INVOER JUDOKA''S'!$P$47,'GEGEVENS-2023'!$AG$4:$AS$113,5,FALSE)),\"\",VLOOKUP('INVOER JUDOKA''S'!$P$47,'GEGEVENS-2023'!$AG$4:$AS$113,5,FALSE))","v":""},{"$f":"IF(ISERROR(VLOOKUP('INVOER JUDOKA''S'!$P$48,'GEGEVENS-2023'!$AG$4:$AS$113,5,FALSE)),\"\",VLOOKUP('INVOER JUDOKA''S'!$P$48,'GEGEVENS-2023'!$AG$4:$AS$113,5,FALSE))","v":""},{"$f":"IF(ISERROR(VLOOKUP('INVOER JUDOKA''S'!$P$49,'GEGEVENS-2023'!$AG$4:$AS$113,5,FALSE)),\"\",VLOOKUP('INVOER JUDOKA''S'!$P$49,'GEGEVENS-2023'!$AG$4:$AS$113,5,FALSE))","v":""},{"$f":"IF(ISERROR(VLOOKUP('INVOER JUDOKA''S'!$P$50,'GEGEVENS-2023'!$AG$4:$AS$113,5,FALSE)),\"\",VLOOKUP('INVOER JUDOKA''S'!$P$50,'GEGEVENS-2023'!$AG$4:$AS$113,5,FALSE))","v":""},{"$f":"IF(ISERROR(VLOOKUP('INVOER JUDOKA''S'!$P$51,'GEGEVENS-2023'!$AG$4:$AS$113,5,FALSE)),\"\",VLOOKUP('INVOER JUDOKA''S'!$P$51,'GEGEVENS-2023'!$AG$4:$AS$113,5,FALSE))","v":""},{"$f":"IF(ISERROR(VLOOKUP('INVOER JUDOKA''S'!$P$52,'GEGEVENS-2023'!$AG$4:$AS$113,5,FALSE)),\"\",VLOOKUP('INVOER JUDOKA''S'!$P$52,'GEGEVENS-2023'!$AG$4:$AS$113,5,FALSE))","v":""},{"$f":"IF(ISERROR(VLOOKUP('INVOER JUDOKA''S'!$P$53,'GEGEVENS-2023'!$AG$4:$AS$113,5,FALSE)),\"\",VLOOKUP('INVOER JUDOKA''S'!$P$53,'GEGEVENS-2023'!$AG$4:$AS$113,5,FALSE))","v":""},{"$f":"IF(ISERROR(VLOOKUP('INVOER JUDOKA''S'!$P$54,'GEGEVENS-2023'!$AG$4:$AS$113,5,FALSE)),\"\",VLOOKUP('INVOER JUDOKA''S'!$P$54,'GEGEVENS-2023'!$AG$4:$AS$113,5,FALSE))","v":""},{"$f":"IF(ISERROR(VLOOKUP('INVOER JUDOKA''S'!$P$55,'GEGEVENS-2023'!$AG$4:$AS$113,5,FALSE)),\"\",VLOOKUP('INVOER JUDOKA''S'!$P$55,'GEGEVENS-2023'!$AG$4:$AS$113,5,FALSE))","v":""}]
[2,{"$f":"IF(ISERROR(VLOOKUP('INVOER JUDOKA''S'!$P$26,'GEGEVENS-2023'!$AG$4:$AS$113,6,FALSE)),\"\",VLOOKUP('INVOER JUDOKA''S'!$P$26,'GEGEVENS-2023'!$AG$4:$AS$113,6,FALSE))","v":""},{"$f":"IF(ISERROR(VLOOKUP('INVOER JUDOKA''S'!$P$27,'GEGEVENS-2023'!$AG$4:$AS$113,6,FALSE)),\"\",VLOOKUP('INVOER JUDOKA''S'!$P$27,'GEGEVENS-2023'!$AG$4:$AS$113,6,FALSE))","v":""},{"$f":"IF(ISERROR(VLOOKUP('INVOER JUDOKA''S'!$P$28,'GEGEVENS-2023'!$AG$4:$AS$113,6,FALSE)),\"\",VLOOKUP('INVOER JUDOKA''S'!$P$28,'GEGEVENS-2023'!$AG$4:$AS$113,6,FALSE))","v":""},{"$f":"IF(ISERROR(VLOOKUP('INVOER JUDOKA''S'!$P$29,'GEGEVENS-2023'!$AG$4:$AS$113,6,FALSE)),\"\",VLOOKUP('INVOER JUDOKA''S'!$P$29,'GEGEVENS-2023'!$AG$4:$AS$113,6,FALSE))","v":""},{"$f":"IF(ISERROR(VLOOKUP('INVOER JUDOKA''S'!$P$30,'GEGEVENS-2023'!$AG$4:$AS$113,6,FALSE)),\"\",VLOOKUP('INVOER JUDOKA''S'!$P$30,'GEGEVENS-2023'!$AG$4:$AS$113,6,FALSE))","v":""},{"$f":"IF(ISERROR(VLOOKUP('INVOER JUDOKA''S'!$P$31,'GEGEVENS-2023'!$AG$4:$AS$113,6,FALSE)),\"\",VLOOKUP('INVOER JUDOKA''S'!$P$31,'GEGEVENS-2023'!$AG$4:$AS$113,6,FALSE))","v":""},{"$f":"IF(ISERROR(VLOOKUP('INVOER JUDOKA''S'!$P$32,'GEGEVENS-2023'!$AG$4:$AS$113,6,FALSE)),\"\",VLOOKUP('INVOER JUDOKA''S'!$P$32,'GEGEVENS-2023'!$AG$4:$AS$113,6,FALSE))","v":""},{"$f":"IF(ISERROR(VLOOKUP('INVOER JUDOKA''S'!$P$33,'GEGEVENS-2023'!$AG$4:$AS$113,6,FALSE)),\"\",VLOOKUP('INVOER JUDOKA''S'!$P$33,'GEGEVENS-2023'!$AG$4:$AS$113,6,FALSE))","v":""},{"$f":"IF(ISERROR(VLOOKUP('INVOER JUDOKA''S'!$P$34,'GEGEVENS-2023'!$AG$4:$AS$113,6,FALSE)),\"\",VLOOKUP('INVOER JUDOKA''S'!$P$34,'GEGEVENS-2023'!$AG$4:$AS$113,6,FALSE))","v":""},{"$f":"IF(ISERROR(VLOOKUP('INVOER JUDOKA''S'!$P$35,'GEGEVENS-2023'!$AG$4:$AS$113,6,FALSE)),\"\",VLOOKUP('INVOER JUDOKA''S'!$P$35,'GEGEVENS-2023'!$AG$4:$AS$113,6,FALSE))","v":""},{"$f":"IF(ISERROR(VLOOKUP('INVOER JUDOKA''S'!$P$36,'GEGEVENS-2023'!$AG$4:$AS$113,6,FALSE)),\"\",VLOOKUP('INVOER JUDOKA''S'!$P$36,'GEGEVENS-2023'!$AG$4:$AS$113,6,FALSE))","v":""},{"$f":"IF(ISERROR(VLOOKUP('INVOER JUDOKA''S'!$P$37,'GEGEVENS-2023'!$AG$4:$AS$113,6,FALSE)),\"\",VLOOKUP('INVOER JUDOKA''S'!$P$37,'GEGEVENS-2023'!$AG$4:$AS$113,6,FALSE))","v":""},{"$f":"IF(ISERROR(VLOOKUP('INVOER JUDOKA''S'!$P$38,'GEGEVENS-2023'!$AG$4:$AS$113,6,FALSE)),\"\",VLOOKUP('INVOER JUDOKA''S'!$P$38,'GEGEVENS-2023'!$AG$4:$AS$113,6,FALSE))","v":""},{"$f":"IF(ISERROR(VLOOKUP('INVOER JUDOKA''S'!$P$39,'GEGEVENS-2023'!$AG$4:$AS$113,6,FALSE)),\"\",VLOOKUP('INVOER JUDOKA''S'!$P$39,'GEGEVENS-2023'!$AG$4:$AS$113,6,FALSE))","v":""},{"$f":"IF(ISERROR(VLOOKUP('INVOER JUDOKA''S'!$P$40,'GEGEVENS-2023'!$AG$4:$AS$113,6,FALSE)),\"\",VLOOKUP('INVOER JUDOKA''S'!$P$40,'GEGEVENS-2023'!$AG$4:$AS$113,6,FALSE))","v":""},{"$f":"IF(ISERROR(VLOOKUP('INVOER JUDOKA''S'!$P$41,'GEGEVENS-2023'!$AG$4:$AS$113,6,FALSE)),\"\",VLOOKUP('INVOER JUDOKA''S'!$P$41,'GEGEVENS-2023'!$AG$4:$AS$113,6,FALSE))","v":""},{"$f":"IF(ISERROR(VLOOKUP('INVOER JUDOKA''S'!$P$42,'GEGEVENS-2023'!$AG$4:$AS$113,6,FALSE)),\"\",VLOOKUP('INVOER JUDOKA''S'!$P$42,'GEGEVENS-2023'!$AG$4:$AS$113,6,FALSE))","v":""},{"$f":"IF(ISERROR(VLOOKUP('INVOER JUDOKA''S'!$P$43,'GEGEVENS-2023'!$AG$4:$AS$113,6,FALSE)),\"\",VLOOKUP('INVOER JUDOKA''S'!$P$43,'GEGEVENS-2023'!$AG$4:$AS$113,6,FALSE))","v":""},{"$f":"IF(ISERROR(VLOOKUP('INVOER JUDOKA''S'!$P$44,'GEGEVENS-2023'!$AG$4:$AS$113,6,FALSE)),\"\",VLOOKUP('INVOER JUDOKA''S'!$P$44,'GEGEVENS-2023'!$AG$4:$AS$113,6,FALSE))","v":""},{"$f":"IF(ISERROR(VLOOKUP('INVOER JUDOKA''S'!$P$45,'GEGEVENS-2023'!$AG$4:$AS$113,6,FALSE)),\"\",VLOOKUP('INVOER JUDOKA''S'!$P$45,'GEGEVENS-2023'!$AG$4:$AS$113,6,FALSE))","v":""},{"$f":"IF(ISERROR(VLOOKUP('INVOER JUDOKA''S'!$P$46,'GEGEVENS-2023'!$AG$4:$AS$113,6,FALSE)),\"\",VLOOKUP('INVOER JUDOKA''S'!$P$46,'GEGEVENS-2023'!$AG$4:$AS$113,6,FALSE))","v":""},{"$f":"IF(ISERROR(VLOOKUP('INVOER JUDOKA''S'!$P$47,'GEGEVENS-2023'!$AG$4:$AS$113,6,FALSE)),\"\",VLOOKUP('INVOER JUDOKA''S'!$P$47,'GEGEVENS-2023'!$AG$4:$AS$113,6,FALSE))","v":""},{"$f":"IF(ISERROR(VLOOKUP('INVOER JUDOKA''S'!$P$48,'GEGEVENS-2023'!$AG$4:$AS$113,6,FALSE)),\"\",VLOOKUP('INVOER JUDOKA''S'!$P$48,'GEGEVENS-2023'!$AG$4:$AS$113,6,FALSE))","v":""},{"$f":"IF(ISERROR(VLOOKUP('INVOER JUDOKA''S'!$P$49,'GEGEVENS-2023'!$AG$4:$AS$113,6,FALSE)),\"\",VLOOKUP('INVOER JUDOKA''S'!$P$49,'GEGEVENS-2023'!$AG$4:$AS$113,6,FALSE))","v":""},{"$f":"IF(ISERROR(VLOOKUP('INVOER JUDOKA''S'!$P$50,'GEGEVENS-2023'!$AG$4:$AS$113,6,FALSE)),\"\",VLOOKUP('INVOER JUDOKA''S'!$P$50,'GEGEVENS-2023'!$AG$4:$AS$113,6,FALSE))","v":""},{"$f":"IF(ISERROR(VLOOKUP('INVOER JUDOKA''S'!$P$51,'GEGEVENS-2023'!$AG$4:$AS$113,6,FALSE)),\"\",VLOOKUP('INVOER JUDOKA''S'!$P$51,'GEGEVENS-2023'!$AG$4:$AS$113,6,FALSE))","v":""},{"$f":"IF(ISERROR(VLOOKUP('INVOER JUDOKA''S'!$P$52,'GEGEVENS-2023'!$AG$4:$AS$113,6,FALSE)),\"\",VLOOKUP('INVOER JUDOKA''S'!$P$52,'GEGEVENS-2023'!$AG$4:$AS$113,6,FALSE))","v":""},{"$f":"IF(ISERROR(VLOOKUP('INVOER JUDOKA''S'!$P$53,'GEGEVENS-2023'!$AG$4:$AS$113,6,FALSE)),\"\",VLOOKUP('INVOER JUDOKA''S'!$P$53,'GEGEVENS-2023'!$AG$4:$AS$113,6,FALSE))","v":""},{"$f":"IF(ISERROR(VLOOKUP('INVOER JUDOKA''S'!$P$54,'GEGEVENS-2023'!$AG$4:$AS$113,6,FALSE)),\"\",VLOOKUP('INVOER JUDOKA''S'!$P$54,'GEGEVENS-2023'!$AG$4:$AS$113,6,FALSE))","v":""},{"$f":"IF(ISERROR(VLOOKUP('INVOER JUDOKA''S'!$P$55,'GEGEVENS-2023'!$AG$4:$AS$113,6,FALSE)),\"\",VLOOKUP('INVOER JUDOKA''S'!$P$55,'GEGEVENS-2023'!$AG$4:$AS$113,6,FALSE))","v":""}]
[3,{"$f":"IF(ISERROR(VLOOKUP('INVOER JUDOKA''S'!$P$26,'GEGEVENS-2023'!$AG$4:$AS$113,7,FALSE)),\"\",VLOOKUP('INVOER JUDOKA''S'!$P$26,'GEGEVENS-2023'!$AG$4:$AS$113,7,FALSE))","v":""},{"$f":"IF(ISERROR(VLOOKUP('INVOER JUDOKA''S'!$P$27,'GEGEVENS-2023'!$AG$4:$AS$113,7,FALSE)),\"\",VLOOKUP('INVOER JUDOKA''S'!$P$27,'GEGEVENS-2023'!$AG$4:$AS$113,7,FALSE))","v":""},{"$f":"IF(ISERROR(VLOOKUP('INVOER JUDOKA''S'!$P$28,'GEGEVENS-2023'!$AG$4:$AS$113,7,FALSE)),\"\",VLOOKUP('INVOER JUDOKA''S'!$P$28,'GEGEVENS-2023'!$AG$4:$AS$113,7,FALSE))","v":""},{"$f":"IF(ISERROR(VLOOKUP('INVOER JUDOKA''S'!$P$29,'GEGEVENS-2023'!$AG$4:$AS$113,7,FALSE)),\"\",VLOOKUP('INVOER JUDOKA''S'!$P$29,'GEGEVENS-2023'!$AG$4:$AS$113,7,FALSE))","v":""},{"$f":"IF(ISERROR(VLOOKUP('INVOER JUDOKA''S'!$P$30,'GEGEVENS-2023'!$AG$4:$AS$113,7,FALSE)),\"\",VLOOKUP('INVOER JUDOKA''S'!$P$30,'GEGEVENS-2023'!$AG$4:$AS$113,7,FALSE))","v":""},{"$f":"IF(ISERROR(VLOOKUP('INVOER JUDOKA''S'!$P$31,'GEGEVENS-2023'!$AG$4:$AS$113,7,FALSE)),\"\",VLOOKUP('INVOER JUDOKA''S'!$P$31,'GEGEVENS-2023'!$AG$4:$AS$113,7,FALSE))","v":""},{"$f":"IF(ISERROR(VLOOKUP('INVOER JUDOKA''S'!$P$32,'GEGEVENS-2023'!$AG$4:$AS$113,7,FALSE)),\"\",VLOOKUP('INVOER JUDOKA''S'!$P$32,'GEGEVENS-2023'!$AG$4:$AS$113,7,FALSE))","v":""},{"$f":"IF(ISERROR(VLOOKUP('INVOER JUDOKA''S'!$P$33,'GEGEVENS-2023'!$AG$4:$AS$113,7,FALSE)),\"\",VLOOKUP('INVOER JUDOKA''S'!$P$33,'GEGEVENS-2023'!$AG$4:$AS$113,7,FALSE))","v":""},{"$f":"IF(ISERROR(VLOOKUP('INVOER JUDOKA''S'!$P$34,'GEGEVENS-2023'!$AG$4:$AS$113,7,FALSE)),\"\",VLOOKUP('INVOER JUDOKA''S'!$P$34,'GEGEVENS-2023'!$AG$4:$AS$113,7,FALSE))","v":""},{"$f":"IF(ISERROR(VLOOKUP('INVOER JUDOKA''S'!$P$35,'GEGEVENS-2023'!$AG$4:$AS$113,7,FALSE)),\"\",VLOOKUP('INVOER JUDOKA''S'!$P$35,'GEGEVENS-2023'!$AG$4:$AS$113,7,FALSE))","v":""},{"$f":"IF(ISERROR(VLOOKUP('INVOER JUDOKA''S'!$P$36,'GEGEVENS-2023'!$AG$4:$AS$113,7,FALSE)),\"\",VLOOKUP('INVOER JUDOKA''S'!$P$36,'GEGEVENS-2023'!$AG$4:$AS$113,7,FALSE))","v":""},{"$f":"IF(ISERROR(VLOOKUP('INVOER JUDOKA''S'!$P$37,'GEGEVENS-2023'!$AG$4:$AS$113,7,FALSE)),\"\",VLOOKUP('INVOER JUDOKA''S'!$P$37,'GEGEVENS-2023'!$AG$4:$AS$113,7,FALSE))","v":""},{"$f":"IF(ISERROR(VLOOKUP('INVOER JUDOKA''S'!$P$38,'GEGEVENS-2023'!$AG$4:$AS$113,7,FALSE)),\"\",VLOOKUP('INVOER JUDOKA''S'!$P$38,'GEGEVENS-2023'!$AG$4:$AS$113,7,FALSE))","v":""},{"$f":"IF(ISERROR(VLOOKUP('INVOER JUDOKA''S'!$P$39,'GEGEVENS-2023'!$AG$4:$AS$113,7,FALSE)),\"\",VLOOKUP('INVOER JUDOKA''S'!$P$39,'GEGEVENS-2023'!$AG$4:$AS$113,7,FALSE))","v":""},{"$f":"IF(ISERROR(VLOOKUP('INVOER JUDOKA''S'!$P$40,'GEGEVENS-2023'!$AG$4:$AS$113,7,FALSE)),\"\",VLOOKUP('INVOER JUDOKA''S'!$P$40,'GEGEVENS-2023'!$AG$4:$AS$113,7,FALSE))","v":""},{"$f":"IF(ISERROR(VLOOKUP('INVOER JUDOKA''S'!$P$41,'GEGEVENS-2023'!$AG$4:$AS$113,7,FALSE)),\"\",VLOOKUP('INVOER JUDOKA''S'!$P$41,'GEGEVENS-2023'!$AG$4:$AS$113,7,FALSE))","v":""},{"$f":"IF(ISERROR(VLOOKUP('INVOER JUDOKA''S'!$P$42,'GEGEVENS-2023'!$AG$4:$AS$113,7,FALSE)),\"\",VLOOKUP('INVOER JUDOKA''S'!$P$42,'GEGEVENS-2023'!$AG$4:$AS$113,7,FALSE))","v":""},{"$f":"IF(ISERROR(VLOOKUP('INVOER JUDOKA''S'!$P$43,'GEGEVENS-2023'!$AG$4:$AS$113,7,FALSE)),\"\",VLOOKUP('INVOER JUDOKA''S'!$P$43,'GEGEVENS-2023'!$AG$4:$AS$113,7,FALSE))","v":""},{"$f":"IF(ISERROR(VLOOKUP('INVOER JUDOKA''S'!$P$44,'GEGEVENS-2023'!$AG$4:$AS$113,7,FALSE)),\"\",VLOOKUP('INVOER JUDOKA''S'!$P$44,'GEGEVENS-2023'!$AG$4:$AS$113,7,FALSE))","v":""},{"$f":"IF(ISERROR(VLOOKUP('INVOER JUDOKA''S'!$P$45,'GEGEVENS-2023'!$AG$4:$AS$113,7,FALSE)),\"\",VLOOKUP('INVOER JUDOKA''S'!$P$45,'GEGEVENS-2023'!$AG$4:$AS$113,7,FALSE))","v":""},{"$f":"IF(ISERROR(VLOOKUP('INVOER JUDOKA''S'!$P$46,'GEGEVENS-2023'!$AG$4:$AS$113,7,FALSE)),\"\",VLOOKUP('INVOER JUDOKA''S'!$P$46,'GEGEVENS-2023'!$AG$4:$AS$113,7,FALSE))","v":""},{"$f":"IF(ISERROR(VLOOKUP('INVOER JUDOKA''S'!$P$47,'GEGEVENS-2023'!$AG$4:$AS$113,7,FALSE)),\"\",VLOOKUP('INVOER JUDOKA''S'!$P$47,'GEGEVENS-2023'!$AG$4:$AS$113,7,FALSE))","v":""},{"$f":"IF(ISERROR(VLOOKUP('INVOER JUDOKA''S'!$P$48,'GEGEVENS-2023'!$AG$4:$AS$113,7,FALSE)),\"\",VLOOKUP('INVOER JUDOKA''S'!$P$48,'GEGEVENS-2023'!$AG$4:$AS$113,7,FALSE))","v":""},{"$f":"IF(ISERROR(VLOOKUP('INVOER JUDOKA''S'!$P$49,'GEGEVENS-2023'!$AG$4:$AS$113,7,FALSE)),\"\",VLOOKUP('INVOER JUDOKA''S'!$P$49,'GEGEVENS-2023'!$AG$4:$AS$113,7,FALSE))","v":""},{"$f":"IF(ISERROR(VLOOKUP('INVOER JUDOKA''S'!$P$50,'GEGEVENS-2023'!$AG$4:$AS$113,7,FALSE)),\"\",VLOOKUP('INVOER JUDOKA''S'!$P$50,'GEGEVENS-2023'!$AG$4:$AS$113,7,FALSE))","v":""},{"$f":"IF(ISERROR(VLOOKUP('INVOER JUDOKA''S'!$P$51,'GEGEVENS-2023'!$AG$4:$AS$113,7,FALSE)),\"\",VLOOKUP('INVOER JUDOKA''S'!$P$51,'GEGEVENS-2023'!$AG$4:$AS$113,7,FALSE))","v":""},{"$f":"IF(ISERROR(VLOOKUP('INVOER JUDOKA''S'!$P$52,'GEGEVENS-2023'!$AG$4:$AS$113,7,FALSE)),\"\",VLOOKUP('INVOER JUDOKA''S'!$P$52,'GEGEVENS-2023'!$AG$4:$AS$113,7,FALSE))","v":""},{"$f":"IF(ISERROR(VLOOKUP('INVOER JUDOKA''S'!$P$53,'GEGEVENS-2023'!$AG$4:$AS$113,7,FALSE)),\"\",VLOOKUP('INVOER JUDOKA''S'!$P$53,'GEGEVENS-2023'!$AG$4:$AS$113,7,FALSE))","v":""},{"$f":"IF(ISERROR(VLOOKUP('INVOER JUDOKA''S'!$P$54,'GEGEVENS-2023'!$AG$4:$AS$113,7,FALSE)),\"\",VLOOKUP('INVOER JUDOKA''S'!$P$54,'GEGEVENS-2023'!$AG$4:$AS$113,7,FALSE))","v":""},{"$f":"IF(ISERROR(VLOOKUP('INVOER JUDOKA''S'!$P$55,'GEGEVENS-2023'!$AG$4:$AS$113,7,FALSE)),\"\",VLOOKUP('INVOER JUDOKA''S'!$P$55,'GEGEVENS-2023'!$AG$4:$AS$113,7,FALSE))","v":""}]
[4,{"$f":"IF(ISERROR(VLOOKUP('INVOER JUDOKA''S'!$P$26,'GEGEVENS-2023'!$AG$4:$AS$113,8,FALSE)),\"\",VLOOKUP('INVOER JUDOKA''S'!$P$26,'GEGEVENS-2023'!$AG$4:$AS$113,8,FALSE))","v":""},{"$f":"IF(ISERROR(VLOOKUP('INVOER JUDOKA''S'!$P$27,'GEGEVENS-2023'!$AG$4:$AS$113,8,FALSE)),\"\",VLOOKUP('INVOER JUDOKA''S'!$P$27,'GEGEVENS-2023'!$AG$4:$AS$113,8,FALSE))","v":""},{"$f":"IF(ISERROR(VLOOKUP('INVOER JUDOKA''S'!$P$28,'GEGEVENS-2023'!$AG$4:$AS$113,8,FALSE)),\"\",VLOOKUP('INVOER JUDOKA''S'!$P$28,'GEGEVENS-2023'!$AG$4:$AS$113,8,FALSE))","v":""},{"$f":"IF(ISERROR(VLOOKUP('INVOER JUDOKA''S'!$P$29,'GEGEVENS-2023'!$AG$4:$AS$113,8,FALSE)),\"\",VLOOKUP('INVOER JUDOKA''S'!$P$29,'GEGEVENS-2023'!$AG$4:$AS$113,8,FALSE))","v":""},{"$f":"IF(ISERROR(VLOOKUP('INVOER JUDOKA''S'!$P$30,'GEGEVENS-2023'!$AG$4:$AS$113,8,FALSE)),\"\",VLOOKUP('INVOER JUDOKA''S'!$P$30,'GEGEVENS-2023'!$AG$4:$AS$113,8,FALSE))","v":""},{"$f":"IF(ISERROR(VLOOKUP('INVOER JUDOKA''S'!$P$31,'GEGEVENS-2023'!$AG$4:$AS$113,8,FALSE)),\"\",VLOOKUP('INVOER JUDOKA''S'!$P$31,'GEGEVENS-2023'!$AG$4:$AS$113,8,FALSE))","v":""},{"$f":"IF(ISERROR(VLOOKUP('INVOER JUDOKA''S'!$P$32,'GEGEVENS-2023'!$AG$4:$AS$113,8,FALSE)),\"\",VLOOKUP('INVOER JUDOKA''S'!$P$32,'GEGEVENS-2023'!$AG$4:$AS$113,8,FALSE))","v":""},{"$f":"IF(ISERROR(VLOOKUP('INVOER JUDOKA''S'!$P$33,'GEGEVENS-2023'!$AG$4:$AS$113,8,FALSE)),\"\",VLOOKUP('INVOER JUDOKA''S'!$P$33,'GEGEVENS-2023'!$AG$4:$AS$113,8,FALSE))","v":""},{"$f":"IF(ISERROR(VLOOKUP('INVOER JUDOKA''S'!$P$34,'GEGEVENS-2023'!$AG$4:$AS$113,8,FALSE)),\"\",VLOOKUP('INVOER JUDOKA''S'!$P$34,'GEGEVENS-2023'!$AG$4:$AS$113,8,FALSE))","v":""},{"$f":"IF(ISERROR(VLOOKUP('INVOER JUDOKA''S'!$P$35,'GEGEVENS-2023'!$AG$4:$AS$113,8,FALSE)),\"\",VLOOKUP('INVOER JUDOKA''S'!$P$35,'GEGEVENS-2023'!$AG$4:$AS$113,8,FALSE))","v":""},{"$f":"IF(ISERROR(VLOOKUP('INVOER JUDOKA''S'!$P$36,'GEGEVENS-2023'!$AG$4:$AS$113,8,FALSE)),\"\",VLOOKUP('INVOER JUDOKA''S'!$P$36,'GEGEVENS-2023'!$AG$4:$AS$113,8,FALSE))","v":""},{"$f":"IF(ISERROR(VLOOKUP('INVOER JUDOKA''S'!$P$37,'GEGEVENS-2023'!$AG$4:$AS$113,8,FALSE)),\"\",VLOOKUP('INVOER JUDOKA''S'!$P$37,'GEGEVENS-2023'!$AG$4:$AS$113,8,FALSE))","v":""},{"$f":"IF(ISERROR(VLOOKUP('INVOER JUDOKA''S'!$P$38,'GEGEVENS-2023'!$AG$4:$AS$113,8,FALSE)),\"\",VLOOKUP('INVOER JUDOKA''S'!$P$38,'GEGEVENS-2023'!$AG$4:$AS$113,8,FALSE))","v":""},{"$f":"IF(ISERROR(VLOOKUP('INVOER JUDOKA''S'!$P$39,'GEGEVENS-2023'!$AG$4:$AS$113,8,FALSE)),\"\",VLOOKUP('INVOER JUDOKA''S'!$P$39,'GEGEVENS-2023'!$AG$4:$AS$113,8,FALSE))","v":""},{"$f":"IF(ISERROR(VLOOKUP('INVOER JUDOKA''S'!$P$40,'GEGEVENS-2023'!$AG$4:$AS$113,8,FALSE)),\"\",VLOOKUP('INVOER JUDOKA''S'!$P$40,'GEGEVENS-2023'!$AG$4:$AS$113,8,FALSE))","v":""},{"$f":"IF(ISERROR(VLOOKUP('INVOER JUDOKA''S'!$P$41,'GEGEVENS-2023'!$AG$4:$AS$113,8,FALSE)),\"\",VLOOKUP('INVOER JUDOKA''S'!$P$41,'GEGEVENS-2023'!$AG$4:$AS$113,8,FALSE))","v":""},{"$f":"IF(ISERROR(VLOOKUP('INVOER JUDOKA''S'!$P$42,'GEGEVENS-2023'!$AG$4:$AS$113,8,FALSE)),\"\",VLOOKUP('INVOER JUDOKA''S'!$P$42,'GEGEVENS-2023'!$AG$4:$AS$113,8,FALSE))","v":""},{"$f":"IF(ISERROR(VLOOKUP('INVOER JUDOKA''S'!$P$43,'GEGEVENS-2023'!$AG$4:$AS$113,8,FALSE)),\"\",VLOOKUP('INVOER JUDOKA''S'!$P$43,'GEGEVENS-2023'!$AG$4:$AS$113,8,FALSE))","v":""},{"$f":"IF(ISERROR(VLOOKUP('INVOER JUDOKA''S'!$P$44,'GEGEVENS-2023'!$AG$4:$AS$113,8,FALSE)),\"\",VLOOKUP('INVOER JUDOKA''S'!$P$44,'GEGEVENS-2023'!$AG$4:$AS$113,8,FALSE))","v":""},{"$f":"IF(ISERROR(VLOOKUP('INVOER JUDOKA''S'!$P$45,'GEGEVENS-2023'!$AG$4:$AS$113,8,FALSE)),\"\",VLOOKUP('INVOER JUDOKA''S'!$P$45,'GEGEVENS-2023'!$AG$4:$AS$113,8,FALSE))","v":""},{"$f":"IF(ISERROR(VLOOKUP('INVOER JUDOKA''S'!$P$46,'GEGEVENS-2023'!$AG$4:$AS$113,8,FALSE)),\"\",VLOOKUP('INVOER JUDOKA''S'!$P$46,'GEGEVENS-2023'!$AG$4:$AS$113,8,FALSE))","v":""},{"$f":"IF(ISERROR(VLOOKUP('INVOER JUDOKA''S'!$P$47,'GEGEVENS-2023'!$AG$4:$AS$113,8,FALSE)),\"\",VLOOKUP('INVOER JUDOKA''S'!$P$47,'GEGEVENS-2023'!$AG$4:$AS$113,8,FALSE))","v":""},{"$f":"IF(ISERROR(VLOOKUP('INVOER JUDOKA''S'!$P$48,'GEGEVENS-2023'!$AG$4:$AS$113,8,FALSE)),\"\",VLOOKUP('INVOER JUDOKA''S'!$P$48,'GEGEVENS-2023'!$AG$4:$AS$113,8,FALSE))","v":""},{"$f":"IF(ISERROR(VLOOKUP('INVOER JUDOKA''S'!$P$49,'GEGEVENS-2023'!$AG$4:$AS$113,8,FALSE)),\"\",VLOOKUP('INVOER JUDOKA''S'!$P$49,'GEGEVENS-2023'!$AG$4:$AS$113,8,FALSE))","v":""},{"$f":"IF(ISERROR(VLOOKUP('INVOER JUDOKA''S'!$P$50,'GEGEVENS-2023'!$AG$4:$AS$113,8,FALSE)),\"\",VLOOKUP('INVOER JUDOKA''S'!$P$50,'GEGEVENS-2023'!$AG$4:$AS$113,8,FALSE))","v":""},{"$f":"IF(ISERROR(VLOOKUP('INVOER JUDOKA''S'!$P$51,'GEGEVENS-2023'!$AG$4:$AS$113,8,FALSE)),\"\",VLOOKUP('INVOER JUDOKA''S'!$P$51,'GEGEVENS-2023'!$AG$4:$AS$113,8,FALSE))","v":""},{"$f":"IF(ISERROR(VLOOKUP('INVOER JUDOKA''S'!$P$52,'GEGEVENS-2023'!$AG$4:$AS$113,8,FALSE)),\"\",VLOOKUP('INVOER JUDOKA''S'!$P$52,'GEGEVENS-2023'!$AG$4:$AS$113,8,FALSE))","v":""},{"$f":"IF(ISERROR(VLOOKUP('INVOER JUDOKA''S'!$P$53,'GEGEVENS-2023'!$AG$4:$AS$113,8,FALSE)),\"\",VLOOKUP('INVOER JUDOKA''S'!$P$53,'GEGEVENS-2023'!$AG$4:$AS$113,8,FALSE))","v":""},{"$f":"IF(ISERROR(VLOOKUP('INVOER JUDOKA''S'!$P$54,'GEGEVENS-2023'!$AG$4:$AS$113,8,FALSE)),\"\",VLOOKUP('INVOER JUDOKA''S'!$P$54,'GEGEVENS-2023'!$AG$4:$AS$113,8,FALSE))","v":""},{"$f":"IF(ISERROR(VLOOKUP('INVOER JUDOKA''S'!$P$55,'GEGEVENS-2023'!$AG$4:$AS$113,8,FALSE)),\"\",VLOOKUP('INVOER JUDOKA''S'!$P$55,'GEGEVENS-2023'!$AG$4:$AS$113,8,FALSE))","v":""}]
[5,{"$f":"IF(ISERROR(VLOOKUP('INVOER JUDOKA''S'!$P$26,'GEGEVENS-2023'!$AG$4:$AS$113,9,FALSE)),\"\",VLOOKUP('INVOER JUDOKA''S'!$P$26,'GEGEVENS-2023'!$AG$4:$AS$113,9,FALSE))","v":""},{"$f":"IF(ISERROR(VLOOKUP('INVOER JUDOKA''S'!$P$27,'GEGEVENS-2023'!$AG$4:$AS$113,9,FALSE)),\"\",VLOOKUP('INVOER JUDOKA''S'!$P$27,'GEGEVENS-2023'!$AG$4:$AS$113,9,FALSE))","v":""},{"$f":"IF(ISERROR(VLOOKUP('INVOER JUDOKA''S'!$P$28,'GEGEVENS-2023'!$AG$4:$AS$113,9,FALSE)),\"\",VLOOKUP('INVOER JUDOKA''S'!$P$28,'GEGEVENS-2023'!$AG$4:$AS$113,9,FALSE))","v":""},{"$f":"IF(ISERROR(VLOOKUP('INVOER JUDOKA''S'!$P$29,'GEGEVENS-2023'!$AG$4:$AS$113,9,FALSE)),\"\",VLOOKUP('INVOER JUDOKA''S'!$P$29,'GEGEVENS-2023'!$AG$4:$AS$113,9,FALSE))","v":""},{"$f":"IF(ISERROR(VLOOKUP('INVOER JUDOKA''S'!$P$30,'GEGEVENS-2023'!$AG$4:$AS$113,9,FALSE)),\"\",VLOOKUP('INVOER JUDOKA''S'!$P$30,'GEGEVENS-2023'!$AG$4:$AS$113,9,FALSE))","v":""},{"$f":"IF(ISERROR(VLOOKUP('INVOER JUDOKA''S'!$P$31,'GEGEVENS-2023'!$AG$4:$AS$113,9,FALSE)),\"\",VLOOKUP('INVOER JUDOKA''S'!$P$31,'GEGEVENS-2023'!$AG$4:$AS$113,9,FALSE))","v":""},{"$f":"IF(ISERROR(VLOOKUP('INVOER JUDOKA''S'!$P$32,'GEGEVENS-2023'!$AG$4:$AS$113,9,FALSE)),\"\",VLOOKUP('INVOER JUDOKA''S'!$P$32,'GEGEVENS-2023'!$AG$4:$AS$113,9,FALSE))","v":""},{"$f":"IF(ISERROR(VLOOKUP('INVOER JUDOKA''S'!$P$33,'GEGEVENS-2023'!$AG$4:$AS$113,9,FALSE)),\"\",VLOOKUP('INVOER JUDOKA''S'!$P$33,'GEGEVENS-2023'!$AG$4:$AS$113,9,FALSE))","v":""},{"$f":"IF(ISERROR(VLOOKUP('INVOER JUDOKA''S'!$P$34,'GEGEVENS-2023'!$AG$4:$AS$113,9,FALSE)),\"\",VLOOKUP('INVOER JUDOKA''S'!$P$34,'GEGEVENS-2023'!$AG$4:$AS$113,9,FALSE))","v":""},{"$f":"IF(ISERROR(VLOOKUP('INVOER JUDOKA''S'!$P$35,'GEGEVENS-2023'!$AG$4:$AS$113,9,FALSE)),\"\",VLOOKUP('INVOER JUDOKA''S'!$P$35,'GEGEVENS-2023'!$AG$4:$AS$113,9,FALSE))","v":""},{"$f":"IF(ISERROR(VLOOKUP('INVOER JUDOKA''S'!$P$36,'GEGEVENS-2023'!$AG$4:$AS$113,9,FALSE)),\"\",VLOOKUP('INVOER JUDOKA''S'!$P$36,'GEGEVENS-2023'!$AG$4:$AS$113,9,FALSE))","v":""},{"$f":"IF(ISERROR(VLOOKUP('INVOER JUDOKA''S'!$P$37,'GEGEVENS-2023'!$AG$4:$AS$113,9,FALSE)),\"\",VLOOKUP('INVOER JUDOKA''S'!$P$37,'GEGEVENS-2023'!$AG$4:$AS$113,9,FALSE))","v":""},{"$f":"IF(ISERROR(VLOOKUP('INVOER JUDOKA''S'!$P$38,'GEGEVENS-2023'!$AG$4:$AS$113,9,FALSE)),\"\",VLOOKUP('INVOER JUDOKA''S'!$P$38,'GEGEVENS-2023'!$AG$4:$AS$113,9,FALSE))","v":""},{"$f":"IF(ISERROR(VLOOKUP('INVOER JUDOKA''S'!$P$39,'GEGEVENS-2023'!$AG$4:$AS$113,9,FALSE)),\"\",VLOOKUP('INVOER JUDOKA''S'!$P$39,'GEGEVENS-2023'!$AG$4:$AS$113,9,FALSE))","v":""},{"$f":"IF(ISERROR(VLOOKUP('INVOER JUDOKA''S'!$P$40,'GEGEVENS-2023'!$AG$4:$AS$113,9,FALSE)),\"\",VLOOKUP('INVOER JUDOKA''S'!$P$40,'GEGEVENS-2023'!$AG$4:$AS$113,9,FALSE))","v":""},{"$f":"IF(ISERROR(VLOOKUP('INVOER JUDOKA''S'!$P$41,'GEGEVENS-2023'!$AG$4:$AS$113,9,FALSE)),\"\",VLOOKUP('INVOER JUDOKA''S'!$P$41,'GEGEVENS-2023'!$AG$4:$AS$113,9,FALSE))","v":""},{"$f":"IF(ISERROR(VLOOKUP('INVOER JUDOKA''S'!$P$42,'GEGEVENS-2023'!$AG$4:$AS$113,9,FALSE)),\"\",VLOOKUP('INVOER JUDOKA''S'!$P$42,'GEGEVENS-2023'!$AG$4:$AS$113,9,FALSE))","v":""},{"$f":"IF(ISERROR(VLOOKUP('INVOER JUDOKA''S'!$P$43,'GEGEVENS-2023'!$AG$4:$AS$113,9,FALSE)),\"\",VLOOKUP('INVOER JUDOKA''S'!$P$43,'GEGEVENS-2023'!$AG$4:$AS$113,9,FALSE))","v":""},{"$f":"IF(ISERROR(VLOOKUP('INVOER JUDOKA''S'!$P$44,'GEGEVENS-2023'!$AG$4:$AS$113,9,FALSE)),\"\",VLOOKUP('INVOER JUDOKA''S'!$P$44,'GEGEVENS-2023'!$AG$4:$AS$113,9,FALSE))","v":""},{"$f":"IF(ISERROR(VLOOKUP('INVOER JUDOKA''S'!$P$45,'GEGEVENS-2023'!$AG$4:$AS$113,9,FALSE)),\"\",VLOOKUP('INVOER JUDOKA''S'!$P$45,'GEGEVENS-2023'!$AG$4:$AS$113,9,FALSE))","v":""},{"$f":"IF(ISERROR(VLOOKUP('INVOER JUDOKA''S'!$P$46,'GEGEVENS-2023'!$AG$4:$AS$113,9,FALSE)),\"\",VLOOKUP('INVOER JUDOKA''S'!$P$46,'GEGEVENS-2023'!$AG$4:$AS$113,9,FALSE))","v":""},{"$f":"IF(ISERROR(VLOOKUP('INVOER JUDOKA''S'!$P$47,'GEGEVENS-2023'!$AG$4:$AS$113,9,FALSE)),\"\",VLOOKUP('INVOER JUDOKA''S'!$P$47,'GEGEVENS-2023'!$AG$4:$AS$113,9,FALSE))","v":""},{"$f":"IF(ISERROR(VLOOKUP('INVOER JUDOKA''S'!$P$48,'GEGEVENS-2023'!$AG$4:$AS$113,9,FALSE)),\"\",VLOOKUP('INVOER JUDOKA''S'!$P$48,'GEGEVENS-2023'!$AG$4:$AS$113,9,FALSE))","v":""},{"$f":"IF(ISERROR(VLOOKUP('INVOER JUDOKA''S'!$P$49,'GEGEVENS-2023'!$AG$4:$AS$113,9,FALSE)),\"\",VLOOKUP('INVOER JUDOKA''S'!$P$49,'GEGEVENS-2023'!$AG$4:$AS$113,9,FALSE))","v":""},{"$f":"IF(ISERROR(VLOOKUP('INVOER JUDOKA''S'!$P$50,'GEGEVENS-2023'!$AG$4:$AS$113,9,FALSE)),\"\",VLOOKUP('INVOER JUDOKA''S'!$P$50,'GEGEVENS-2023'!$AG$4:$AS$113,9,FALSE))","v":""},{"$f":"IF(ISERROR(VLOOKUP('INVOER JUDOKA''S'!$P$51,'GEGEVENS-2023'!$AG$4:$AS$113,9,FALSE)),\"\",VLOOKUP('INVOER JUDOKA''S'!$P$51,'GEGEVENS-2023'!$AG$4:$AS$113,9,FALSE))","v":""},{"$f":"IF(ISERROR(VLOOKUP('INVOER JUDOKA''S'!$P$52,'GEGEVENS-2023'!$AG$4:$AS$113,9,FALSE)),\"\",VLOOKUP('INVOER JUDOKA''S'!$P$52,'GEGEVENS-2023'!$AG$4:$AS$113,9,FALSE))","v":""},{"$f":"IF(ISERROR(VLOOKUP('INVOER JUDOKA''S'!$P$53,'GEGEVENS-2023'!$AG$4:$AS$113,9,FALSE)),\"\",VLOOKUP('INVOER JUDOKA''S'!$P$53,'GEGEVENS-2023'!$AG$4:$AS$113,9,FALSE))","v":""},{"$f":"IF(ISERROR(VLOOKUP('INVOER JUDOKA''S'!$P$54,'GEGEVENS-2023'!$AG$4:$AS$113,9,FALSE)),\"\",VLOOKUP('INVOER JUDOKA''S'!$P$54,'GEGEVENS-2023'!$AG$4:$AS$113,9,FALSE))","v":""},{"$f":"IF(ISERROR(VLOOKUP('INVOER JUDOKA''S'!$P$55,'GEGEVENS-2023'!$AG$4:$AS$113,9,FALSE)),\"\",VLOOKUP('INVOER JUDOKA''S'!$P$55,'GEGEVENS-2023'!$AG$4:$AS$113,9,FALSE))","v":""}]
[6,{"$f":"IF(ISERROR(VLOOKUP('INVOER JUDOKA''S'!$P$26,'GEGEVENS-2023'!$AG$4:$AS$113,10,FALSE)),\"\",VLOOKUP('INVOER JUDOKA''S'!$P$26,'GEGEVENS-2023'!$AG$4:$AS$113,10,FALSE))","v":""},{"$f":"IF(ISERROR(VLOOKUP('INVOER JUDOKA''S'!$P$27,'GEGEVENS-2023'!$AG$4:$AS$113,10,FALSE)),\"\",VLOOKUP('INVOER JUDOKA''S'!$P$27,'GEGEVENS-2023'!$AG$4:$AS$113,10,FALSE))","v":""},{"$f":"IF(ISERROR(VLOOKUP('INVOER JUDOKA''S'!$P$28,'GEGEVENS-2023'!$AG$4:$AS$113,10,FALSE)),\"\",VLOOKUP('INVOER JUDOKA''S'!$P$28,'GEGEVENS-2023'!$AG$4:$AS$113,10,FALSE))","v":""},{"$f":"IF(ISERROR(VLOOKUP('INVOER JUDOKA''S'!$P$29,'GEGEVENS-2023'!$AG$4:$AS$113,10,FALSE)),\"\",VLOOKUP('INVOER JUDOKA''S'!$P$29,'GEGEVENS-2023'!$AG$4:$AS$113,10,FALSE))","v":""},{"$f":"IF(ISERROR(VLOOKUP('INVOER JUDOKA''S'!$P$30,'GEGEVENS-2023'!$AG$4:$AS$113,10,FALSE)),\"\",VLOOKUP('INVOER JUDOKA''S'!$P$30,'GEGEVENS-2023'!$AG$4:$AS$113,10,FALSE))","v":""},{"$f":"IF(ISERROR(VLOOKUP('INVOER JUDOKA''S'!$P$31,'GEGEVENS-2023'!$AG$4:$AS$113,10,FALSE)),\"\",VLOOKUP('INVOER JUDOKA''S'!$P$31,'GEGEVENS-2023'!$AG$4:$AS$113,10,FALSE))","v":""},{"$f":"IF(ISERROR(VLOOKUP('INVOER JUDOKA''S'!$P$32,'GEGEVENS-2023'!$AG$4:$AS$113,10,FALSE)),\"\",VLOOKUP('INVOER JUDOKA''S'!$P$32,'GEGEVENS-2023'!$AG$4:$AS$113,10,FALSE))","v":""},{"$f":"IF(ISERROR(VLOOKUP('INVOER JUDOKA''S'!$P$33,'GEGEVENS-2023'!$AG$4:$AS$113,10,FALSE)),\"\",VLOOKUP('INVOER JUDOKA''S'!$P$33,'GEGEVENS-2023'!$AG$4:$AS$113,10,FALSE))","v":""},{"$f":"IF(ISERROR(VLOOKUP('INVOER JUDOKA''S'!$P$34,'GEGEVENS-2023'!$AG$4:$AS$113,10,FALSE)),\"\",VLOOKUP('INVOER JUDOKA''S'!$P$34,'GEGEVENS-2023'!$AG$4:$AS$113,10,FALSE))","v":""},{"$f":"IF(ISERROR(VLOOKUP('INVOER JUDOKA''S'!$P$35,'GEGEVENS-2023'!$AG$4:$AS$113,10,FALSE)),\"\",VLOOKUP('INVOER JUDOKA''S'!$P$35,'GEGEVENS-2023'!$AG$4:$AS$113,10,FALSE))","v":""},{"$f":"IF(ISERROR(VLOOKUP('INVOER JUDOKA''S'!$P$36,'GEGEVENS-2023'!$AG$4:$AS$113,10,FALSE)),\"\",VLOOKUP('INVOER JUDOKA''S'!$P$36,'GEGEVENS-2023'!$AG$4:$AS$113,10,FALSE))","v":""},{"$f":"IF(ISERROR(VLOOKUP('INVOER JUDOKA''S'!$P$37,'GEGEVENS-2023'!$AG$4:$AS$113,10,FALSE)),\"\",VLOOKUP('INVOER JUDOKA''S'!$P$37,'GEGEVENS-2023'!$AG$4:$AS$113,10,FALSE))","v":""},{"$f":"IF(ISERROR(VLOOKUP('INVOER JUDOKA''S'!$P$38,'GEGEVENS-2023'!$AG$4:$AS$113,10,FALSE)),\"\",VLOOKUP('INVOER JUDOKA''S'!$P$38,'GEGEVENS-2023'!$AG$4:$AS$113,10,FALSE))","v":""},{"$f":"IF(ISERROR(VLOOKUP('INVOER JUDOKA''S'!$P$39,'GEGEVENS-2023'!$AG$4:$AS$113,10,FALSE)),\"\",VLOOKUP('INVOER JUDOKA''S'!$P$39,'GEGEVENS-2023'!$AG$4:$AS$113,10,FALSE))","v":""},{"$f":"IF(ISERROR(VLOOKUP('INVOER JUDOKA''S'!$P$40,'GEGEVENS-2023'!$AG$4:$AS$113,10,FALSE)),\"\",VLOOKUP('INVOER JUDOKA''S'!$P$40,'GEGEVENS-2023'!$AG$4:$AS$113,10,FALSE))","v":""},{"$f":"IF(ISERROR(VLOOKUP('INVOER JUDOKA''S'!$P$41,'GEGEVENS-2023'!$AG$4:$AS$113,10,FALSE)),\"\",VLOOKUP('INVOER JUDOKA''S'!$P$41,'GEGEVENS-2023'!$AG$4:$AS$113,10,FALSE))","v":""},{"$f":"IF(ISERROR(VLOOKUP('INVOER JUDOKA''S'!$P$42,'GEGEVENS-2023'!$AG$4:$AS$113,10,FALSE)),\"\",VLOOKUP('INVOER JUDOKA''S'!$P$42,'GEGEVENS-2023'!$AG$4:$AS$113,10,FALSE))","v":""},{"$f":"IF(ISERROR(VLOOKUP('INVOER JUDOKA''S'!$P$43,'GEGEVENS-2023'!$AG$4:$AS$113,10,FALSE)),\"\",VLOOKUP('INVOER JUDOKA''S'!$P$43,'GEGEVENS-2023'!$AG$4:$AS$113,10,FALSE))","v":""},{"$f":"IF(ISERROR(VLOOKUP('INVOER JUDOKA''S'!$P$44,'GEGEVENS-2023'!$AG$4:$AS$113,10,FALSE)),\"\",VLOOKUP('INVOER JUDOKA''S'!$P$44,'GEGEVENS-2023'!$AG$4:$AS$113,10,FALSE))","v":""},{"$f":"IF(ISERROR(VLOOKUP('INVOER JUDOKA''S'!$P$45,'GEGEVENS-2023'!$AG$4:$AS$113,10,FALSE)),\"\",VLOOKUP('INVOER JUDOKA''S'!$P$45,'GEGEVENS-2023'!$AG$4:$AS$113,10,FALSE))","v":""},{"$f":"IF(ISERROR(VLOOKUP('INVOER JUDOKA''S'!$P$46,'GEGEVENS-2023'!$AG$4:$AS$113,10,FALSE)),\"\",VLOOKUP('INVOER JUDOKA''S'!$P$46,'GEGEVENS-2023'!$AG$4:$AS$113,10,FALSE))","v":""},{"$f":"IF(ISERROR(VLOOKUP('INVOER JUDOKA''S'!$P$47,'GEGEVENS-2023'!$AG$4:$AS$113,10,FALSE)),\"\",VLOOKUP('INVOER JUDOKA''S'!$P$47,'GEGEVENS-2023'!$AG$4:$AS$113,10,FALSE))","v":""},{"$f":"IF(ISERROR(VLOOKUP('INVOER JUDOKA''S'!$P$48,'GEGEVENS-2023'!$AG$4:$AS$113,10,FALSE)),\"\",VLOOKUP('INVOER JUDOKA''S'!$P$48,'GEGEVENS-2023'!$AG$4:$AS$113,10,FALSE))","v":""},{"$f":"IF(ISERROR(VLOOKUP('INVOER JUDOKA''S'!$P$49,'GEGEVENS-2023'!$AG$4:$AS$113,10,FALSE)),\"\",VLOOKUP('INVOER JUDOKA''S'!$P$49,'GEGEVENS-2023'!$AG$4:$AS$113,10,FALSE))","v":""},{"$f":"IF(ISERROR(VLOOKUP('INVOER JUDOKA''S'!$P$50,'GEGEVENS-2023'!$AG$4:$AS$113,10,FALSE)),\"\",VLOOKUP('INVOER JUDOKA''S'!$P$50,'GEGEVENS-2023'!$AG$4:$AS$113,10,FALSE))","v":""},{"$f":"IF(ISERROR(VLOOKUP('INVOER JUDOKA''S'!$P$51,'GEGEVENS-2023'!$AG$4:$AS$113,10,FALSE)),\"\",VLOOKUP('INVOER JUDOKA''S'!$P$51,'GEGEVENS-2023'!$AG$4:$AS$113,10,FALSE))","v":""},{"$f":"IF(ISERROR(VLOOKUP('INVOER JUDOKA''S'!$P$52,'GEGEVENS-2023'!$AG$4:$AS$113,10,FALSE)),\"\",VLOOKUP('INVOER JUDOKA''S'!$P$52,'GEGEVENS-2023'!$AG$4:$AS$113,10,FALSE))","v":""},{"$f":"IF(ISERROR(VLOOKUP('INVOER JUDOKA''S'!$P$53,'GEGEVENS-2023'!$AG$4:$AS$113,10,FALSE)),\"\",VLOOKUP('INVOER JUDOKA''S'!$P$53,'GEGEVENS-2023'!$AG$4:$AS$113,10,FALSE))","v":""},{"$f":"IF(ISERROR(VLOOKUP('INVOER JUDOKA''S'!$P$54,'GEGEVENS-2023'!$AG$4:$AS$113,10,FALSE)),\"\",VLOOKUP('INVOER JUDOKA''S'!$P$54,'GEGEVENS-2023'!$AG$4:$AS$113,10,FALSE))","v":""},{"$f":"IF(ISERROR(VLOOKUP('INVOER JUDOKA''S'!$P$55,'GEGEVENS-2023'!$AG$4:$AS$113,10,FALSE)),\"\",VLOOKUP('INVOER JUDOKA''S'!$P$55,'GEGEVENS-2023'!$AG$4:$AS$113,10,FALSE))","v":""}]
[7,{"$f":"IF(ISERROR(VLOOKUP('INVOER JUDOKA''S'!$P$26,'GEGEVENS-2023'!$AG$4:$AS$113,11,FALSE)),\"\",VLOOKUP('INVOER JUDOKA''S'!$P$26,'GEGEVENS-2023'!$AG$4:$AS$113,11,FALSE))","v":""},{"$f":"IF(ISERROR(VLOOKUP('INVOER JUDOKA''S'!$P$27,'GEGEVENS-2023'!$AG$4:$AS$113,11,FALSE)),\"\",VLOOKUP('INVOER JUDOKA''S'!$P$27,'GEGEVENS-2023'!$AG$4:$AS$113,11,FALSE))","v":""},{"$f":"IF(ISERROR(VLOOKUP('INVOER JUDOKA''S'!$P$28,'GEGEVENS-2023'!$AG$4:$AS$113,11,FALSE)),\"\",VLOOKUP('INVOER JUDOKA''S'!$P$28,'GEGEVENS-2023'!$AG$4:$AS$113,11,FALSE))","v":""},{"$f":"IF(ISERROR(VLOOKUP('INVOER JUDOKA''S'!$P$29,'GEGEVENS-2023'!$AG$4:$AS$113,11,FALSE)),\"\",VLOOKUP('INVOER JUDOKA''S'!$P$29,'GEGEVENS-2023'!$AG$4:$AS$113,11,FALSE))","v":""},{"$f":"IF(ISERROR(VLOOKUP('INVOER JUDOKA''S'!$P$30,'GEGEVENS-2023'!$AG$4:$AS$113,11,FALSE)),\"\",VLOOKUP('INVOER JUDOKA''S'!$P$30,'GEGEVENS-2023'!$AG$4:$AS$113,11,FALSE))","v":""},{"$f":"IF(ISERROR(VLOOKUP('INVOER JUDOKA''S'!$P$31,'GEGEVENS-2023'!$AG$4:$AS$113,11,FALSE)),\"\",VLOOKUP('INVOER JUDOKA''S'!$P$31,'GEGEVENS-2023'!$AG$4:$AS$113,11,FALSE))","v":""},{"$f":"IF(ISERROR(VLOOKUP('INVOER JUDOKA''S'!$P$32,'GEGEVENS-2023'!$AG$4:$AS$113,11,FALSE)),\"\",VLOOKUP('INVOER JUDOKA''S'!$P$32,'GEGEVENS-2023'!$AG$4:$AS$113,11,FALSE))","v":""},{"$f":"IF(ISERROR(VLOOKUP('INVOER JUDOKA''S'!$P$33,'GEGEVENS-2023'!$AG$4:$AS$113,11,FALSE)),\"\",VLOOKUP('INVOER JUDOKA''S'!$P$33,'GEGEVENS-2023'!$AG$4:$AS$113,11,FALSE))","v":""},{"$f":"IF(ISERROR(VLOOKUP('INVOER JUDOKA''S'!$P$34,'GEGEVENS-2023'!$AG$4:$AS$113,11,FALSE)),\"\",VLOOKUP('INVOER JUDOKA''S'!$P$34,'GEGEVENS-2023'!$AG$4:$AS$113,11,FALSE))","v":""},{"$f":"IF(ISERROR(VLOOKUP('INVOER JUDOKA''S'!$P$35,'GEGEVENS-2023'!$AG$4:$AS$113,11,FALSE)),\"\",VLOOKUP('INVOER JUDOKA''S'!$P$35,'GEGEVENS-2023'!$AG$4:$AS$113,11,FALSE))","v":""},{"$f":"IF(ISERROR(VLOOKUP('INVOER JUDOKA''S'!$P$36,'GEGEVENS-2023'!$AG$4:$AS$113,11,FALSE)),\"\",VLOOKUP('INVOER JUDOKA''S'!$P$36,'GEGEVENS-2023'!$AG$4:$AS$113,11,FALSE))","v":""},{"$f":"IF(ISERROR(VLOOKUP('INVOER JUDOKA''S'!$P$37,'GEGEVENS-2023'!$AG$4:$AS$113,11,FALSE)),\"\",VLOOKUP('INVOER JUDOKA''S'!$P$37,'GEGEVENS-2023'!$AG$4:$AS$113,11,FALSE))","v":""},{"$f":"IF(ISERROR(VLOOKUP('INVOER JUDOKA''S'!$P$38,'GEGEVENS-2023'!$AG$4:$AS$113,11,FALSE)),\"\",VLOOKUP('INVOER JUDOKA''S'!$P$38,'GEGEVENS-2023'!$AG$4:$AS$113,11,FALSE))","v":""},{"$f":"IF(ISERROR(VLOOKUP('INVOER JUDOKA''S'!$P$39,'GEGEVENS-2023'!$AG$4:$AS$113,11,FALSE)),\"\",VLOOKUP('INVOER JUDOKA''S'!$P$39,'GEGEVENS-2023'!$AG$4:$AS$113,11,FALSE))","v":""},{"$f":"IF(ISERROR(VLOOKUP('INVOER JUDOKA''S'!$P$40,'GEGEVENS-2023'!$AG$4:$AS$113,11,FALSE)),\"\",VLOOKUP('INVOER JUDOKA''S'!$P$40,'GEGEVENS-2023'!$AG$4:$AS$113,11,FALSE))","v":""},{"$f":"IF(ISERROR(VLOOKUP('INVOER JUDOKA''S'!$P$41,'GEGEVENS-2023'!$AG$4:$AS$113,11,FALSE)),\"\",VLOOKUP('INVOER JUDOKA''S'!$P$41,'GEGEVENS-2023'!$AG$4:$AS$113,11,FALSE))","v":""},{"$f":"IF(ISERROR(VLOOKUP('INVOER JUDOKA''S'!$P$42,'GEGEVENS-2023'!$AG$4:$AS$113,11,FALSE)),\"\",VLOOKUP('INVOER JUDOKA''S'!$P$42,'GEGEVENS-2023'!$AG$4:$AS$113,11,FALSE))","v":""},{"$f":"IF(ISERROR(VLOOKUP('INVOER JUDOKA''S'!$P$43,'GEGEVENS-2023'!$AG$4:$AS$113,11,FALSE)),\"\",VLOOKUP('INVOER JUDOKA''S'!$P$43,'GEGEVENS-2023'!$AG$4:$AS$113,11,FALSE))","v":""},{"$f":"IF(ISERROR(VLOOKUP('INVOER JUDOKA''S'!$P$44,'GEGEVENS-2023'!$AG$4:$AS$113,11,FALSE)),\"\",VLOOKUP('INVOER JUDOKA''S'!$P$44,'GEGEVENS-2023'!$AG$4:$AS$113,11,FALSE))","v":""},{"$f":"IF(ISERROR(VLOOKUP('INVOER JUDOKA''S'!$P$45,'GEGEVENS-2023'!$AG$4:$AS$113,11,FALSE)),\"\",VLOOKUP('INVOER JUDOKA''S'!$P$45,'GEGEVENS-2023'!$AG$4:$AS$113,11,FALSE))","v":""},{"$f":"IF(ISERROR(VLOOKUP('INVOER JUDOKA''S'!$P$46,'GEGEVENS-2023'!$AG$4:$AS$113,11,FALSE)),\"\",VLOOKUP('INVOER JUDOKA''S'!$P$46,'GEGEVENS-2023'!$AG$4:$AS$113,11,FALSE))","v":""},{"$f":"IF(ISERROR(VLOOKUP('INVOER JUDOKA''S'!$P$47,'GEGEVENS-2023'!$AG$4:$AS$113,11,FALSE)),\"\",VLOOKUP('INVOER JUDOKA''S'!$P$47,'GEGEVENS-2023'!$AG$4:$AS$113,11,FALSE))","v":""},{"$f":"IF(ISERROR(VLOOKUP('INVOER JUDOKA''S'!$P$48,'GEGEVENS-2023'!$AG$4:$AS$113,11,FALSE)),\"\",VLOOKUP('INVOER JUDOKA''S'!$P$48,'GEGEVENS-2023'!$AG$4:$AS$113,11,FALSE))","v":""},{"$f":"IF(ISERROR(VLOOKUP('INVOER JUDOKA''S'!$P$49,'GEGEVENS-2023'!$AG$4:$AS$113,11,FALSE)),\"\",VLOOKUP('INVOER JUDOKA''S'!$P$49,'GEGEVENS-2023'!$AG$4:$AS$113,11,FALSE))","v":""},{"$f":"IF(ISERROR(VLOOKUP('INVOER JUDOKA''S'!$P$50,'GEGEVENS-2023'!$AG$4:$AS$113,11,FALSE)),\"\",VLOOKUP('INVOER JUDOKA''S'!$P$50,'GEGEVENS-2023'!$AG$4:$AS$113,11,FALSE))","v":""},{"$f":"IF(ISERROR(VLOOKUP('INVOER JUDOKA''S'!$P$51,'GEGEVENS-2023'!$AG$4:$AS$113,11,FALSE)),\"\",VLOOKUP('INVOER JUDOKA''S'!$P$51,'GEGEVENS-2023'!$AG$4:$AS$113,11,FALSE))","v":""},{"$f":"IF(ISERROR(VLOOKUP('INVOER JUDOKA''S'!$P$52,'GEGEVENS-2023'!$AG$4:$AS$113,11,FALSE)),\"\",VLOOKUP('INVOER JUDOKA''S'!$P$52,'GEGEVENS-2023'!$AG$4:$AS$113,11,FALSE))","v":""},{"$f":"IF(ISERROR(VLOOKUP('INVOER JUDOKA''S'!$P$53,'GEGEVENS-2023'!$AG$4:$AS$113,11,FALSE)),\"\",VLOOKUP('INVOER JUDOKA''S'!$P$53,'GEGEVENS-2023'!$AG$4:$AS$113,11,FALSE))","v":""},{"$f":"IF(ISERROR(VLOOKUP('INVOER JUDOKA''S'!$P$54,'GEGEVENS-2023'!$AG$4:$AS$113,11,FALSE)),\"\",VLOOKUP('INVOER JUDOKA''S'!$P$54,'GEGEVENS-2023'!$AG$4:$AS$113,11,FALSE))","v":""},{"$f":"IF(ISERROR(VLOOKUP('INVOER JUDOKA''S'!$P$55,'GEGEVENS-2023'!$AG$4:$AS$113,11,FALSE)),\"\",VLOOKUP('INVOER JUDOKA''S'!$P$55,'GEGEVENS-2023'!$AG$4:$AS$113,11,FALSE))","v":""}]
[8,{"$f":"IF(ISERROR(VLOOKUP('INVOER JUDOKA''S'!$P$26,'GEGEVENS-2023'!$AG$4:$AS$113,12,FALSE)),\"\",VLOOKUP('INVOER JUDOKA''S'!$P$26,'GEGEVENS-2023'!$AG$4:$AS$113,12,FALSE))","v":""},{"$f":"IF(ISERROR(VLOOKUP('INVOER JUDOKA''S'!$P$27,'GEGEVENS-2023'!$AG$4:$AS$113,12,FALSE)),\"\",VLOOKUP('INVOER JUDOKA''S'!$P$27,'GEGEVENS-2023'!$AG$4:$AS$113,12,FALSE))","v":""},{"$f":"IF(ISERROR(VLOOKUP('INVOER JUDOKA''S'!$P$28,'GEGEVENS-2023'!$AG$4:$AS$113,12,FALSE)),\"\",VLOOKUP('INVOER JUDOKA''S'!$P$28,'GEGEVENS-2023'!$AG$4:$AS$113,12,FALSE))","v":""},{"$f":"IF(ISERROR(VLOOKUP('INVOER JUDOKA''S'!$P$29,'GEGEVENS-2023'!$AG$4:$AS$113,12,FALSE)),\"\",VLOOKUP('INVOER JUDOKA''S'!$P$29,'GEGEVENS-2023'!$AG$4:$AS$113,12,FALSE))","v":""},{"$f":"IF(ISERROR(VLOOKUP('INVOER JUDOKA''S'!$P$30,'GEGEVENS-2023'!$AG$4:$AS$113,12,FALSE)),\"\",VLOOKUP('INVOER JUDOKA''S'!$P$30,'GEGEVENS-2023'!$AG$4:$AS$113,12,FALSE))","v":""},{"$f":"IF(ISERROR(VLOOKUP('INVOER JUDOKA''S'!$P$31,'GEGEVENS-2023'!$AG$4:$AS$113,12,FALSE)),\"\",VLOOKUP('INVOER JUDOKA''S'!$P$31,'GEGEVENS-2023'!$AG$4:$AS$113,12,FALSE))","v":""},{"$f":"IF(ISERROR(VLOOKUP('INVOER JUDOKA''S'!$P$32,'GEGEVENS-2023'!$AG$4:$AS$113,12,FALSE)),\"\",VLOOKUP('INVOER JUDOKA''S'!$P$32,'GEGEVENS-2023'!$AG$4:$AS$113,12,FALSE))","v":""},{"$f":"IF(ISERROR(VLOOKUP('INVOER JUDOKA''S'!$P$33,'GEGEVENS-2023'!$AG$4:$AS$113,12,FALSE)),\"\",VLOOKUP('INVOER JUDOKA''S'!$P$33,'GEGEVENS-2023'!$AG$4:$AS$113,12,FALSE))","v":""},{"$f":"IF(ISERROR(VLOOKUP('INVOER JUDOKA''S'!$P$34,'GEGEVENS-2023'!$AG$4:$AS$113,12,FALSE)),\"\",VLOOKUP('INVOER JUDOKA''S'!$P$34,'GEGEVENS-2023'!$AG$4:$AS$113,12,FALSE))","v":""},{"$f":"IF(ISERROR(VLOOKUP('INVOER JUDOKA''S'!$P$35,'GEGEVENS-2023'!$AG$4:$AS$113,12,FALSE)),\"\",VLOOKUP('INVOER JUDOKA''S'!$P$35,'GEGEVENS-2023'!$AG$4:$AS$113,12,FALSE))","v":""},{"$f":"IF(ISERROR(VLOOKUP('INVOER JUDOKA''S'!$P$36,'GEGEVENS-2023'!$AG$4:$AS$113,12,FALSE)),\"\",VLOOKUP('INVOER JUDOKA''S'!$P$36,'GEGEVENS-2023'!$AG$4:$AS$113,12,FALSE))","v":""},{"$f":"IF(ISERROR(VLOOKUP('INVOER JUDOKA''S'!$P$37,'GEGEVENS-2023'!$AG$4:$AS$113,12,FALSE)),\"\",VLOOKUP('INVOER JUDOKA''S'!$P$37,'GEGEVENS-2023'!$AG$4:$AS$113,12,FALSE))","v":""},{"$f":"IF(ISERROR(VLOOKUP('INVOER JUDOKA''S'!$P$38,'GEGEVENS-2023'!$AG$4:$AS$113,12,FALSE)),\"\",VLOOKUP('INVOER JUDOKA''S'!$P$38,'GEGEVENS-2023'!$AG$4:$AS$113,12,FALSE))","v":""},{"$f":"IF(ISERROR(VLOOKUP('INVOER JUDOKA''S'!$P$39,'GEGEVENS-2023'!$AG$4:$AS$113,12,FALSE)),\"\",VLOOKUP('INVOER JUDOKA''S'!$P$39,'GEGEVENS-2023'!$AG$4:$AS$113,12,FALSE))","v":""},{"$f":"IF(ISERROR(VLOOKUP('INVOER JUDOKA''S'!$P$40,'GEGEVENS-2023'!$AG$4:$AS$113,12,FALSE)),\"\",VLOOKUP('INVOER JUDOKA''S'!$P$40,'GEGEVENS-2023'!$AG$4:$AS$113,12,FALSE))","v":""},{"$f":"IF(ISERROR(VLOOKUP('INVOER JUDOKA''S'!$P$41,'GEGEVENS-2023'!$AG$4:$AS$113,12,FALSE)),\"\",VLOOKUP('INVOER JUDOKA''S'!$P$41,'GEGEVENS-2023'!$AG$4:$AS$113,12,FALSE))","v":""},{"$f":"IF(ISERROR(VLOOKUP('INVOER JUDOKA''S'!$P$42,'GEGEVENS-2023'!$AG$4:$AS$113,12,FALSE)),\"\",VLOOKUP('INVOER JUDOKA''S'!$P$42,'GEGEVENS-2023'!$AG$4:$AS$113,12,FALSE))","v":""},{"$f":"IF(ISERROR(VLOOKUP('INVOER JUDOKA''S'!$P$43,'GEGEVENS-2023'!$AG$4:$AS$113,12,FALSE)),\"\",VLOOKUP('INVOER JUDOKA''S'!$P$43,'GEGEVENS-2023'!$AG$4:$AS$113,12,FALSE))","v":""},{"$f":"IF(ISERROR(VLOOKUP('INVOER JUDOKA''S'!$P$44,'GEGEVENS-2023'!$AG$4:$AS$113,12,FALSE)),\"\",VLOOKUP('INVOER JUDOKA''S'!$P$44,'GEGEVENS-2023'!$AG$4:$AS$113,12,FALSE))","v":""},{"$f":"IF(ISERROR(VLOOKUP('INVOER JUDOKA''S'!$P$45,'GEGEVENS-2023'!$AG$4:$AS$113,12,FALSE)),\"\",VLOOKUP('INVOER JUDOKA''S'!$P$45,'GEGEVENS-2023'!$AG$4:$AS$113,12,FALSE))","v":""},{"$f":"IF(ISERROR(VLOOKUP('INVOER JUDOKA''S'!$P$46,'GEGEVENS-2023'!$AG$4:$AS$113,12,FALSE)),\"\",VLOOKUP('INVOER JUDOKA''S'!$P$46,'GEGEVENS-2023'!$AG$4:$AS$113,12,FALSE))","v":""},{"$f":"IF(ISERROR(VLOOKUP('INVOER JUDOKA''S'!$P$47,'GEGEVENS-2023'!$AG$4:$AS$113,12,FALSE)),\"\",VLOOKUP('INVOER JUDOKA''S'!$P$47,'GEGEVENS-2023'!$AG$4:$AS$113,12,FALSE))","v":""},{"$f":"IF(ISERROR(VLOOKUP('INVOER JUDOKA''S'!$P$48,'GEGEVENS-2023'!$AG$4:$AS$113,12,FALSE)),\"\",VLOOKUP('INVOER JUDOKA''S'!$P$48,'GEGEVENS-2023'!$AG$4:$AS$113,12,FALSE))","v":""},{"$f":"IF(ISERROR(VLOOKUP('INVOER JUDOKA''S'!$P$49,'GEGEVENS-2023'!$AG$4:$AS$113,12,FALSE)),\"\",VLOOKUP('INVOER JUDOKA''S'!$P$49,'GEGEVENS-2023'!$AG$4:$AS$113,12,FALSE))","v":""},{"$f":"IF(ISERROR(VLOOKUP('INVOER JUDOKA''S'!$P$50,'GEGEVENS-2023'!$AG$4:$AS$113,12,FALSE)),\"\",VLOOKUP('INVOER JUDOKA''S'!$P$50,'GEGEVENS-2023'!$AG$4:$AS$113,12,FALSE))","v":""},{"$f":"IF(ISERROR(VLOOKUP('INVOER JUDOKA''S'!$P$51,'GEGEVENS-2023'!$AG$4:$AS$113,12,FALSE)),\"\",VLOOKUP('INVOER JUDOKA''S'!$P$51,'GEGEVENS-2023'!$AG$4:$AS$113,12,FALSE))","v":""},{"$f":"IF(ISERROR(VLOOKUP('INVOER JUDOKA''S'!$P$52,'GEGEVENS-2023'!$AG$4:$AS$113,12,FALSE)),\"\",VLOOKUP('INVOER JUDOKA''S'!$P$52,'GEGEVENS-2023'!$AG$4:$AS$113,12,FALSE))","v":""},{"$f":"IF(ISERROR(VLOOKUP('INVOER JUDOKA''S'!$P$53,'GEGEVENS-2023'!$AG$4:$AS$113,12,FALSE)),\"\",VLOOKUP('INVOER JUDOKA''S'!$P$53,'GEGEVENS-2023'!$AG$4:$AS$113,12,FALSE))","v":""},{"$f":"IF(ISERROR(VLOOKUP('INVOER JUDOKA''S'!$P$54,'GEGEVENS-2023'!$AG$4:$AS$113,12,FALSE)),\"\",VLOOKUP('INVOER JUDOKA''S'!$P$54,'GEGEVENS-2023'!$AG$4:$AS$113,12,FALSE))","v":""},{"$f":"IF(ISERROR(VLOOKUP('INVOER JUDOKA''S'!$P$55,'GEGEVENS-2023'!$AG$4:$AS$113,12,FALSE)),\"\",VLOOKUP('INVOER JUDOKA''S'!$P$55,'GEGEVENS-2023'!$AG$4:$AS$113,12,FALSE))","v":""}]
[9,{"$f":"IF(ISERROR(VLOOKUP('INVOER JUDOKA''S'!$P$26,'GEGEVENS-2023'!$AG$4:$AS$113,13,FALSE)),\"\",VLOOKUP('INVOER JUDOKA''S'!$P$26,'GEGEVENS-2023'!$AG$4:$AS$113,13,FALSE))","v":""},{"$f":"IF(ISERROR(VLOOKUP('INVOER JUDOKA''S'!$P$27,'GEGEVENS-2023'!$AG$4:$AS$113,13,FALSE)),\"\",VLOOKUP('INVOER JUDOKA''S'!$P$27,'GEGEVENS-2023'!$AG$4:$AS$113,13,FALSE))","v":""},{"$f":"IF(ISERROR(VLOOKUP('INVOER JUDOKA''S'!$P$28,'GEGEVENS-2023'!$AG$4:$AS$113,13,FALSE)),\"\",VLOOKUP('INVOER JUDOKA''S'!$P$28,'GEGEVENS-2023'!$AG$4:$AS$113,13,FALSE))","v":""},{"$f":"IF(ISERROR(VLOOKUP('INVOER JUDOKA''S'!$P$29,'GEGEVENS-2023'!$AG$4:$AS$113,13,FALSE)),\"\",VLOOKUP('INVOER JUDOKA''S'!$P$29,'GEGEVENS-2023'!$AG$4:$AS$113,13,FALSE))","v":""},{"$f":"IF(ISERROR(VLOOKUP('INVOER JUDOKA''S'!$P$30,'GEGEVENS-2023'!$AG$4:$AS$113,13,FALSE)),\"\",VLOOKUP('INVOER JUDOKA''S'!$P$30,'GEGEVENS-2023'!$AG$4:$AS$113,13,FALSE))","v":""},{"$f":"IF(ISERROR(VLOOKUP('INVOER JUDOKA''S'!$P$31,'GEGEVENS-2023'!$AG$4:$AS$113,13,FALSE)),\"\",VLOOKUP('INVOER JUDOKA''S'!$P$31,'GEGEVENS-2023'!$AG$4:$AS$113,13,FALSE))","v":""},{"$f":"IF(ISERROR(VLOOKUP('INVOER JUDOKA''S'!$P$32,'GEGEVENS-2023'!$AG$4:$AS$113,13,FALSE)),\"\",VLOOKUP('INVOER JUDOKA''S'!$P$32,'GEGEVENS-2023'!$AG$4:$AS$113,13,FALSE))","v":""},{"$f":"IF(ISERROR(VLOOKUP('INVOER JUDOKA''S'!$P$33,'GEGEVENS-2023'!$AG$4:$AS$113,13,FALSE)),\"\",VLOOKUP('INVOER JUDOKA''S'!$P$33,'GEGEVENS-2023'!$AG$4:$AS$113,13,FALSE))","v":""},{"$f":"IF(ISERROR(VLOOKUP('INVOER JUDOKA''S'!$P$34,'GEGEVENS-2023'!$AG$4:$AS$113,13,FALSE)),\"\",VLOOKUP('INVOER JUDOKA''S'!$P$34,'GEGEVENS-2023'!$AG$4:$AS$113,13,FALSE))","v":""},{"$f":"IF(ISERROR(VLOOKUP('INVOER JUDOKA''S'!$P$35,'GEGEVENS-2023'!$AG$4:$AS$113,13,FALSE)),\"\",VLOOKUP('INVOER JUDOKA''S'!$P$35,'GEGEVENS-2023'!$AG$4:$AS$113,13,FALSE))","v":""},{"$f":"IF(ISERROR(VLOOKUP('INVOER JUDOKA''S'!$P$36,'GEGEVENS-2023'!$AG$4:$AS$113,13,FALSE)),\"\",VLOOKUP('INVOER JUDOKA''S'!$P$36,'GEGEVENS-2023'!$AG$4:$AS$113,13,FALSE))","v":""},{"$f":"IF(ISERROR(VLOOKUP('INVOER JUDOKA''S'!$P$37,'GEGEVENS-2023'!$AG$4:$AS$113,13,FALSE)),\"\",VLOOKUP('INVOER JUDOKA''S'!$P$37,'GEGEVENS-2023'!$AG$4:$AS$113,13,FALSE))","v":""},{"$f":"IF(ISERROR(VLOOKUP('INVOER JUDOKA''S'!$P$38,'GEGEVENS-2023'!$AG$4:$AS$113,13,FALSE)),\"\",VLOOKUP('INVOER JUDOKA''S'!$P$38,'GEGEVENS-2023'!$AG$4:$AS$113,13,FALSE))","v":""},{"$f":"IF(ISERROR(VLOOKUP('INVOER JUDOKA''S'!$P$39,'GEGEVENS-2023'!$AG$4:$AS$113,13,FALSE)),\"\",VLOOKUP('INVOER JUDOKA''S'!$P$39,'GEGEVENS-2023'!$AG$4:$AS$113,13,FALSE))","v":""},{"$f":"IF(ISERROR(VLOOKUP('INVOER JUDOKA''S'!$P$40,'GEGEVENS-2023'!$AG$4:$AS$113,13,FALSE)),\"\",VLOOKUP('INVOER JUDOKA''S'!$P$40,'GEGEVENS-2023'!$AG$4:$AS$113,13,FALSE))","v":""},{"$f":"IF(ISERROR(VLOOKUP('INVOER JUDOKA''S'!$P$41,'GEGEVENS-2023'!$AG$4:$AS$113,13,FALSE)),\"\",VLOOKUP('INVOER JUDOKA''S'!$P$41,'GEGEVENS-2023'!$AG$4:$AS$113,13,FALSE))","v":""},{"$f":"IF(ISERROR(VLOOKUP('INVOER JUDOKA''S'!$P$42,'GEGEVENS-2023'!$AG$4:$AS$113,13,FALSE)),\"\",VLOOKUP('INVOER JUDOKA''S'!$P$42,'GEGEVENS-2023'!$AG$4:$AS$113,13,FALSE))","v":""},{"$f":"IF(ISERROR(VLOOKUP('INVOER JUDOKA''S'!$P$43,'GEGEVENS-2023'!$AG$4:$AS$113,13,FALSE)),\"\",VLOOKUP('INVOER JUDOKA''S'!$P$43,'GEGEVENS-2023'!$AG$4:$AS$113,13,FALSE))","v":""},{"$f":"IF(ISERROR(VLOOKUP('INVOER JUDOKA''S'!$P$44,'GEGEVENS-2023'!$AG$4:$AS$113,13,FALSE)),\"\",VLOOKUP('INVOER JUDOKA''S'!$P$44,'GEGEVENS-2023'!$AG$4:$AS$113,13,FALSE))","v":""},{"$f":"IF(ISERROR(VLOOKUP('INVOER JUDOKA''S'!$P$45,'GEGEVENS-2023'!$AG$4:$AS$113,13,FALSE)),\"\",VLOOKUP('INVOER JUDOKA''S'!$P$45,'GEGEVENS-2023'!$AG$4:$AS$113,13,FALSE))","v":""},{"$f":"IF(ISERROR(VLOOKUP('INVOER JUDOKA''S'!$P$46,'GEGEVENS-2023'!$AG$4:$AS$113,13,FALSE)),\"\",VLOOKUP('INVOER JUDOKA''S'!$P$46,'GEGEVENS-2023'!$AG$4:$AS$113,13,FALSE))","v":""},{"$f":"IF(ISERROR(VLOOKUP('INVOER JUDOKA''S'!$P$47,'GEGEVENS-2023'!$AG$4:$AS$113,13,FALSE)),\"\",VLOOKUP('INVOER JUDOKA''S'!$P$47,'GEGEVENS-2023'!$AG$4:$AS$113,13,FALSE))","v":""},{"$f":"IF(ISERROR(VLOOKUP('INVOER JUDOKA''S'!$P$48,'GEGEVENS-2023'!$AG$4:$AS$113,13,FALSE)),\"\",VLOOKUP('INVOER JUDOKA''S'!$P$48,'GEGEVENS-2023'!$AG$4:$AS$113,13,FALSE))","v":""},{"$f":"IF(ISERROR(VLOOKUP('INVOER JUDOKA''S'!$P$49,'GEGEVENS-2023'!$AG$4:$AS$113,13,FALSE)),\"\",VLOOKUP('INVOER JUDOKA''S'!$P$49,'GEGEVENS-2023'!$AG$4:$AS$113,13,FALSE))","v":""},{"$f":"IF(ISERROR(VLOOKUP('INVOER JUDOKA''S'!$P$50,'GEGEVENS-2023'!$AG$4:$AS$113,13,FALSE)),\"\",VLOOKUP('INVOER JUDOKA''S'!$P$50,'GEGEVENS-2023'!$AG$4:$AS$113,13,FALSE))","v":""},{"$f":"IF(ISERROR(VLOOKUP('INVOER JUDOKA''S'!$P$51,'GEGEVENS-2023'!$AG$4:$AS$113,13,FALSE)),\"\",VLOOKUP('INVOER JUDOKA''S'!$P$51,'GEGEVENS-2023'!$AG$4:$AS$113,13,FALSE))","v":""},{"$f":"IF(ISERROR(VLOOKUP('INVOER JUDOKA''S'!$P$52,'GEGEVENS-2023'!$AG$4:$AS$113,13,FALSE)),\"\",VLOOKUP('INVOER JUDOKA''S'!$P$52,'GEGEVENS-2023'!$AG$4:$AS$113,13,FALSE))","v":""},{"$f":"IF(ISERROR(VLOOKUP('INVOER JUDOKA''S'!$P$53,'GEGEVENS-2023'!$AG$4:$AS$113,13,FALSE)),\"\",VLOOKUP('INVOER JUDOKA''S'!$P$53,'GEGEVENS-2023'!$AG$4:$AS$113,13,FALSE))","v":""},{"$f":"IF(ISERROR(VLOOKUP('INVOER JUDOKA''S'!$P$54,'GEGEVENS-2023'!$AG$4:$AS$113,13,FALSE)),\"\",VLOOKUP('INVOER JUDOKA''S'!$P$54,'GEGEVENS-2023'!$AG$4:$AS$113,13,FALSE))","v":""},{"$f":"IF(ISERROR(VLOOKUP('INVOER JUDOKA''S'!$P$55,'GEGEVENS-2023'!$AG$4:$AS$113,13,FALSE)),\"\",VLOOKUP('INVOER JUDOKA''S'!$P$55,'GEGEVENS-2023'!$AG$4:$AS$113,13,FALSE))","v":""}]

{"sheet":"Blad4","index":7,"n_rows":7,"n_cols":20,"rows_kept":7,"cut":false,"hidden":true,"merged":[]}
[null,null,null,null,null,null,null,"VOORNAAM","ACHTERNAAM","JUDOKA","aantal deelnemers","X-NR.","JBN NR.","GEB.DAT.","GESLACHT","GW","GRADUATIE","ERVARING","CATEGORIE","POULE"]
[null,null,null,null,null,null,null,"Ronald","van Grinsven","Ronald van Grinsven",null,null,123456,"5-3-1964","MAN"," -81 KG.","1E KYU (BRUIN)",null,"HEREN/+21 JAAR/ -81 KG.",155]
[null,null,null,null,null,null,null,"johan","wijnen","johan wijnen",null,null,"1458","4-7-2002","MAN"," -81 KG.","1E KYU (BRUIN)",null,"JONGENS/-18 JAAR/ -81 KG.",141]
[null,null,null,null,null,null,null,0,0,"0 0",null,null,0,{"$error":"#N/A"},{"$error":"#N/A"},{"$error":"#N/A"},{"$error":"#N/A"},null,{"$error":"#N/A"},{"$error":"#N/A"}]
[null,null,null,null,null,null,null,0,0,"0 0",null,null,0,"6-9-1968","VROUW"," -57 KG.","3E KYU (GROEN)",null,"DAMES/+21 JAAR/ -57 KG.",253]
[null,null,null,null,null,null,null,0,0,"0 0",null,null,0,{"$error":"#N/A"},{"$error":"#N/A"},{"$error":"#N/A"},{"$error":"#N/A"},null,{"$error":"#N/A"},{"$error":"#N/A"}]
[null,null,null,null,null,null,null,0,0,"0 0",null,null,0,{"$error":"#N/A"},{"$error":"#N/A"},{"$error":"#N/A"},{"$error":"#N/A"},null,{"$error":"#N/A"},{"$error":"#N/A"}]